BDBM230741 US9340530, 76
SMILES: C[C@H]1OC(=O)[C@]2(CN)CC(F)(F)[C@@H](C)[C@H](\C=C\c3ccc(cn3)-c3ccccc3C#N)C12
InChI Key: InChIKey=GPMFKZJCVQKCNZ-SATMQZBVSA-N
Data: 1 IC50
Activity Spreadsheet -- Enzyme Inhibition Constant Data from BindingDB
Found 1 hit for monomerid = 230741
Trg + Lig
Ki
nM
ΔG°
kcal/mole
IC50
nM
Kd
nM
EC50/IC50
nM
koff
s-1
kon
M-1s-1
pHTemp
°C
Proteinase-activated receptor 1
(Homo sapiens (Human))
BDBM230741
(US9340530, 76)
Show SMILES C[C@H]1OC(=O)[C@]2(CN)CC(F)(F)[C@@H](C)[C@H](\C=C\c3ccc(cn3)-c3ccccc3C#N)C12 |r|
Show InChI InChI=1S/C25H25F2N3O2/c1-15-20(22-16(2)32-23(31)24(22,14-29)13-25(15,26)27)10-9-19-8-7-18(12-30-19)21-6-4-3-5-17(21)11-28/h3-10,12,15-16,20,22H,13-14,29H2,1-2H3/b10-9+/t15-,16+,20-,22?,24-/m0/s1
US Patent
n/an/a 2.30n/an/an/an/an/an/a
Merck Sharp & Dohme Corp.
US Patent
Assay Description
HEK 293 Cells were grown in media containing DMEM, 10% FBS pen/strep/L-Glutamine and non-essential amino acids. The cells were plated in 384-well PDL...
US Patent US9340530 (2016)
BindingDB Entry DOI: 10.7270/Q2K35SJH