BDBM230898 US10188642, Example 24::US9334286, 24
SMILES: COC1CN(C1)C(=O)c1ccc(Nc2cc3cc(ccc3cn2)-c2cnn(C)c2)c(OC)c1
InChI Key: InChIKey=RCJYMSGCQHWXHQ-UHFFFAOYSA-N
Data: 2 IC50
Activity Spreadsheet -- Enzyme Inhibition Constant Data from BindingDB
Found 2 hits for monomerid = 230898
Trg + Lig
Ki
nM
ΔG°
kcal/mole
IC50
nM
Kd
nM
EC50/IC50
nM
koff
s-1
kon
M-1s-1
pHTemp
°C
Dual specificity protein kinase TTK
(Homo sapiens (Human))
BDBM230898
(US10188642, Example 24 | US9334286, 24)
Show SMILES COC1CN(C1)C(=O)c1ccc(Nc2cc3cc(ccc3cn2)-c2cnn(C)c2)c(OC)c1
Show InChI InChI=1S/C25H25N5O3/c1-29-13-20(12-27-29)16-4-5-18-11-26-24(10-19(18)8-16)28-22-7-6-17(9-23(22)33-3)25(31)30-14-21(15-30)32-2/h4-13,21H,14-15H2,1-3H3,(H,26,28)
US Patent
n/an/a 2n/an/an/an/an/an/a
Cancer Research Technology Limited
US Patent
Assay Description
The enzyme reaction (total volume 10 μl) was carried out in black 384-well low volume plates containing full length MPS1 (12.5 nM or 3 nM), fluo...
US Patent US10188642 (2019)
BindingDB Entry DOI: 10.7270/Q2D50Q2N
Dual specificity protein kinase TTK
(Homo sapiens (Human))
BDBM230898
(US10188642, Example 24 | US9334286, 24)
Show SMILES COC1CN(C1)C(=O)c1ccc(Nc2cc3cc(ccc3cn2)-c2cnn(C)c2)c(OC)c1
Show InChI InChI=1S/C25H25N5O3/c1-29-13-20(12-27-29)16-4-5-18-11-26-24(10-19(18)8-16)28-22-7-6-17(9-23(22)33-3)25(31)30-14-21(15-30)32-2/h4-13,21H,14-15H2,1-3H3,(H,26,28)
US Patent
n/an/a 2n/an/an/an/a7.025
Cancer Research Technology Limited
US Patent
Assay Description
The enzyme reaction (total volume 10 μl) was carried out in black 384-well low volume plates containing full length MPS1 (12.5 nM or 3 nM), fluo...
US Patent US9334286 (2016)
BindingDB Entry DOI: 10.7270/Q2GB22X3