BDBM232205 N-2-fluorobenzoyl-L-leucine-glycine benzyl ester (1)
SMILES: CC(C)C[C@H](NC(=O)c1ccccc1F)C(=O)NCC(=O)Oc1ccccc1
InChI Key: InChIKey=CIAFINAEYOYSBA-SFHVURJKSA-N
Data: 1 IC50
Activity Spreadsheet -- Enzyme Inhibition Constant Data from BindingDB
Found 1 hit for monomerid = 232205
Trg + Lig
Ki
nM
ΔG°
kcal/mole
IC50
nM
Kd
nM
EC50/IC50
nM
koff
s-1
kon
M-1s-1
pHTemp
°C
Cathepsin L1 (CL1)
(Fasciola hepatica (Liver fluke))
BDBM232205
(N-2-fluorobenzoyl-L-leucine-glycine benzyl ester (...)
Show SMILES CC(C)C[C@H](NC(=O)c1ccccc1F)C(=O)NCC(=O)Oc1ccccc1 |r|
Show InChI InChI=1S/C21H23FN2O4/c1-14(2)12-18(24-20(26)16-10-6-7-11-17(16)22)21(27)23-13-19(25)28-15-8-4-3-5-9-15/h3-11,14,18H,12-13H2,1-2H3,(H,23,27)(H,24,26)/t18-/m0/s1
n/an/a>1.00E+5n/an/an/an/an/an/a
Dublin City University
Assay Description
The protease was activated by the addition of dithiothreitol, ethylenediaminetetraacetic acid (EDTA), and sodium acetate followed by incubation at 37...
J Enzyme Inhib Med Chem 25: 1-12 (2010)
Article DOI: 10.3109/14756360902888184
BindingDB Entry DOI: 10.7270/Q29G5KP4