BDBM232207 N-4-fluorobenzoyl-L-leucine-glycine benzyl ester (3)
SMILES: CC(C)C[C@H](NC(=O)c1ccc(F)cc1)C(=O)NCC(=O)Oc1ccccc1
InChI Key: InChIKey=ZDXNKZSMOUWXOI-SFHVURJKSA-N
Data: 1 IC50
Activity Spreadsheet -- Enzyme Inhibition Constant Data from BindingDB
Found 1 hit for monomerid = 232207
Trg + Lig
Ki
nM
ΔG°
kcal/mole
IC50
nM
Kd
nM
EC50/IC50
nM
koff
s-1
kon
M-1s-1
pHTemp
°C
Cathepsin L1 (CL1)
(Fasciola hepatica (Liver fluke))
BDBM232207
(N-4-fluorobenzoyl-L-leucine-glycine benzyl ester (...)
Show SMILES CC(C)C[C@H](NC(=O)c1ccc(F)cc1)C(=O)NCC(=O)Oc1ccccc1 |r|
Show InChI InChI=1S/C21H23FN2O4/c1-14(2)12-18(24-20(26)15-8-10-16(22)11-9-15)21(27)23-13-19(25)28-17-6-4-3-5-7-17/h3-11,14,18H,12-13H2,1-2H3,(H,23,27)(H,24,26)/t18-/m0/s1
n/an/a 4.34E+4n/an/an/an/an/an/a
Dublin City University
Assay Description
The protease was activated by the addition of dithiothreitol, ethylenediaminetetraacetic acid (EDTA), and sodium acetate followed by incubation at 37...
J Enzyme Inhib Med Chem 25: 1-12 (2010)
Article DOI: 10.3109/14756360902888184
BindingDB Entry DOI: 10.7270/Q29G5KP4