BDBM232220 N-pentafluorobenzoyl-L-alanine-glycine nitrile (16)
SMILES: C[C@H](NC(=O)c1c(F)c(F)c(F)c(F)c1F)C(=O)NCC#N
InChI Key: InChIKey=FAOZCTSZVDAZDK-BYPYZUCNSA-N
Data: 1 IC50
Activity Spreadsheet -- Enzyme Inhibition Constant Data from BindingDB
Found 1 hit for monomerid = 232220
Trg + Lig
Ki
nM
ΔG°
kcal/mole
IC50
nM
Kd
nM
EC50/IC50
nM
koff
s-1
kon
M-1s-1
pHTemp
°C
Cathepsin L1 (CL1)
(Fasciola hepatica (Liver fluke))
BDBM232220
(N-pentafluorobenzoyl-L-alanine-glycine nitrile (16...)
Show SMILES C[C@H](NC(=O)c1c(F)c(F)c(F)c(F)c1F)C(=O)NCC#N |r|
Show InChI InChI=1S/C12H8F5N3O2/c1-4(11(21)19-3-2-18)20-12(22)5-6(13)8(15)10(17)9(16)7(5)14/h4H,3H2,1H3,(H,19,21)(H,20,22)/t4-/m0/s1
n/an/a 6.83E+4n/an/an/an/an/an/a
Dublin City University
Assay Description
The protease was activated by the addition of dithiothreitol, ethylenediaminetetraacetic acid (EDTA), and sodium acetate followed by incubation at 37...
J Enzyme Inhib Med Chem 25: 1-12 (2010)
Article DOI: 10.3109/14756360902888184
BindingDB Entry DOI: 10.7270/Q29G5KP4