BDBM232230 N-3,4-difluorobenzoyl-L-leucine-glycine nitrile (26)
SMILES: CC(C)C[C@H](NC(=O)c1ccc(F)c(F)c1)C(=O)NCC#N
InChI Key: InChIKey=IKVXVFBSHRPRPA-ZDUSSCGKSA-N
Data: 1 IC50
Activity Spreadsheet -- Enzyme Inhibition Constant Data from BindingDB
Found 1 hit for monomerid = 232230
Trg + Lig
Ki
nM
ΔG°
kcal/mole
IC50
nM
Kd
nM
EC50/IC50
nM
koff
s-1
kon
M-1s-1
pHTemp
°C
Cathepsin L1 (CL1)
(Fasciola hepatica (Liver fluke))
BDBM232230
(N-3,4-difluorobenzoyl-L-leucine-glycine nitrile (2...)
Show SMILES CC(C)C[C@H](NC(=O)c1ccc(F)c(F)c1)C(=O)NCC#N |r|
Show InChI InChI=1S/C15H17F2N3O2/c1-9(2)7-13(15(22)19-6-5-18)20-14(21)10-3-4-11(16)12(17)8-10/h3-4,8-9,13H,6-7H2,1-2H3,(H,19,22)(H,20,21)/t13-/m0/s1
n/an/a 3.10E+3n/an/an/an/an/an/a
Dublin City University
Assay Description
The protease was activated by the addition of dithiothreitol, ethylenediaminetetraacetic acid (EDTA), and sodium acetate followed by incubation at 37...
J Enzyme Inhib Med Chem 25: 1-12 (2010)
Article DOI: 10.3109/14756360902888184
BindingDB Entry DOI: 10.7270/Q29G5KP4