BDBM232235 N-3,4,5-trifluorobenzoyl-L-leucine-glycine nitrile
SMILES: CC(C)C[C@H](NC(=O)c1cc(F)c(F)c(F)c1)C(=O)NCC#N
InChI Key: InChIKey=NDRJENNIMDLLIX-LBPRGKRZSA-N
Data: 1 IC50
Activity Spreadsheet -- Enzyme Inhibition Constant Data from BindingDB
Found 1 hit for monomerid = 232235
Trg + Lig
Ki
nM
ΔG°
kcal/mole
IC50
nM
Kd
nM
EC50/IC50
nM
koff
s-1
kon
M-1s-1
pHTemp
°C
Cathepsin L1 (CL1)
(Fasciola hepatica (Liver fluke))
BDBM232235
(N-3,4,5-trifluorobenzoyl-L-leucine-glycine nitrile)
Show SMILES CC(C)C[C@H](NC(=O)c1cc(F)c(F)c(F)c1)C(=O)NCC#N |r|
Show InChI InChI=1S/C15H16F3N3O2/c1-8(2)5-12(15(23)20-4-3-19)21-14(22)9-6-10(16)13(18)11(17)7-9/h6-8,12H,4-5H2,1-2H3,(H,20,23)(H,21,22)/t12-/m0/s1
n/an/a 3.40E+3n/an/an/an/an/an/a
Dublin City University
Assay Description
The protease was activated by the addition of dithiothreitol, ethylenediaminetetraacetic acid (EDTA), and sodium acetate followed by incubation at 37...
J Enzyme Inhib Med Chem 25: 1-12 (2010)
Article DOI: 10.3109/14756360902888184
BindingDB Entry DOI: 10.7270/Q29G5KP4