BDBM23242 1,2(1,5)-Isoxazole, IOA1::3-hydroxy-1,2-oxazole-4-carboxylic acid
SMILES: OC(=O)c1co[nH]c1=O
InChI Key: InChIKey=JLPHBZYAQYOJND-UHFFFAOYSA-N
Data: 1 KI  3 IC50
PDB links: 1 PDB ID matches this monomer.
Activity Spreadsheet -- Enzyme Inhibition Constant Data from BindingDB
Found 3 hits for monomerid = 23242
Trg + Lig
Ki
nM
ΔG°
kcal/mole
IC50
nM
Kd
nM
EC50/IC50
nM
koff
s-1
kon
M-1s-1
pHTemp
°C
Lactate Dehydrogenase
(Plasmodium falciparum)
BDBM23242
(1,2(1,5)-Isoxazole, IOA1 | 3-hydroxy-1,2-oxazole-4...)
Show SMILES OC(=O)c1co[nH]c1=O
Show InChI InChI=1S/C4H3NO4/c6-3-2(4(7)8)1-9-5-3/h1H,(H,5,6)(H,7,8)
470 -8.63 1.10E+3n/an/an/an/a7.525
University of Bristol
Assay Description
An LDH enzymatic assay developed for high throughput format was used. The dehydrogenase reaction was run in the lactate to pyruvate direction and cou...
J Biol Chem 279: 31429-39 (2004)
Article DOI: 10.1074/jbc.M402433200
BindingDB Entry DOI: 10.7270/Q2CR5RN4
3D
3D Structure (crystal)
Lactate dehydrogenase A (LDHA)
(Homo sapiens (Human))
BDBM23242
(1,2(1,5)-Isoxazole, IOA1 | 3-hydroxy-1,2-oxazole-4...)
Show SMILES OC(=O)c1co[nH]c1=O
Show InChI InChI=1S/C4H3NO4/c6-3-2(4(7)8)1-9-5-3/h1H,(H,5,6)(H,7,8)
Reactome pathway
n/an/a 5.40E+4n/an/an/an/an/an/a
Universita` di Pisa
Curated by ChEMBL
Assay Description
Inhibition of human LDH-A using pyruvate as substrate and NADH as cofactor at 125 uM after 5 mins by calorimetric assay relative to control
J Med Chem 54: 1599-612 (2011)
Article DOI: 10.1021/jm101007q
BindingDB Entry DOI: 10.7270/Q2J38SVC
Lactate dehydrogenase B (LDHB)
(Homo sapiens (Human))
BDBM23242
(1,2(1,5)-Isoxazole, IOA1 | 3-hydroxy-1,2-oxazole-4...)
Show SMILES OC(=O)c1co[nH]c1=O
Show InChI InChI=1S/C4H3NO4/c6-3-2(4(7)8)1-9-5-3/h1H,(H,5,6)(H,7,8)
Reactome pathway
n/an/a 5.40E+4n/an/an/an/an/an/a
University of Bristol
Assay Description
An LDH enzymatic assay developed for high throughput format was used. The dehydrogenase reaction was run in the lactate to pyruvate direction and cou...
J Biol Chem 279: 31429-39 (2004)
Article DOI: 10.1074/jbc.M402433200
BindingDB Entry DOI: 10.7270/Q2CR5RN4