BDBM23243 1,2(1,5)-Isoxazole, IOA2::4-hydroxy-1,2-oxazole-3-carboxylic acid
SMILES: OC(=O)c1nocc1O
InChI Key: InChIKey=CGLGFQXJBUOAAP-UHFFFAOYSA-N
Data: 2 IC50
Activity Spreadsheet -- Enzyme Inhibition Constant Data from BindingDB
Found 2 hits for monomerid = 23243
Trg + Lig
Ki
nM
ΔG°
kcal/mole
IC50
nM
Kd
nM
EC50/IC50
nM
koff
s-1
kon
M-1s-1
pHTemp
°C
Lactate dehydrogenase B (LDHB)
(Homo sapiens (Human))
BDBM23243
(1,2(1,5)-Isoxazole, IOA2 | 4-hydroxy-1,2-oxazole-3...)
Show SMILES OC(=O)c1nocc1O
Show InChI InChI=1S/C4H3NO4/c6-2-1-9-5-3(2)4(7)8/h1,6H,(H,7,8)
Reactome pathway
n/an/a>1.00E+5n/an/an/an/an/an/a
University of Bristol
Assay Description
An LDH enzymatic assay developed for high throughput format was used. The dehydrogenase reaction was run in the lactate to pyruvate direction and cou...
J Biol Chem 279: 31429-39 (2004)
Article DOI: 10.1074/jbc.M402433200
BindingDB Entry DOI: 10.7270/Q2CR5RN4
Lactate Dehydrogenase
(Plasmodium falciparum)
BDBM23243
(1,2(1,5)-Isoxazole, IOA2 | 4-hydroxy-1,2-oxazole-3...)
Show SMILES OC(=O)c1nocc1O
Show InChI InChI=1S/C4H3NO4/c6-2-1-9-5-3(2)4(7)8/h1,6H,(H,7,8)
n/an/a 1.60E+4n/an/an/an/a7.525
University of Bristol
Assay Description
An LDH enzymatic assay developed for high throughput format was used. The dehydrogenase reaction was run in the lactate to pyruvate direction and cou...
J Biol Chem 279: 31429-39 (2004)
Article DOI: 10.1074/jbc.M402433200
BindingDB Entry DOI: 10.7270/Q2CR5RN4