BDBM232997 (S)-(-)-endo-2-norbornyl-N-n-butylcarbamate
SMILES: CCCCNC(=O)OC1CC2CCC1C2
InChI Key: InChIKey=NKHCFCYNTBJWOA-UHFFFAOYSA-N
Data: 1 KI
Activity Spreadsheet -- Enzyme Inhibition Constant Data from BindingDB
Found 1 hit for monomerid = 232997
Trg + Lig
Ki
nM
ΔG°
kcal/mole
IC50
nM
Kd
nM
EC50/IC50
nM
koff
s-1
kon
M-1s-1
pHTemp
°C
Butyrylcholinesterase (BChE)
(Equus caballus (Horse))
BDBM232997
((S)-(-)-endo-2-norbornyl-N-n-butylcarbamate)
Show SMILES CCCCNC(=O)OC1CC2CCC1C2 |TLB:7:8:12.11:14|
Show InChI InChI=1S/C12H21NO2/c1-2-3-6-13-12(14)15-11-8-9-4-5-10(11)7-9/h9-11H,2-8H2,1H3,(H,13,14)
2 -11.9n/an/an/an/an/a7.025
Chung Shan Medical University Hospital
Assay Description
BChE inhibitions by the carbamate inhibitors were assayed by the Ellman method [Ellman et al., Biochem. Pharm., 7:88-95]. BChE-catalyzed hydrolysis o...
J Enzyme Inhib Med Chem 25: 13-20 (2010)
Article DOI: 10.3109/14756360902888200
BindingDB Entry DOI: 10.7270/Q2C8286J