BDBM233041 3,20-Dioxopregna-4,6-dien-17α-yl acetate (7)
SMILES: CC(=O)O[C@@]1(CCC2C3C=CC4=CC(=O)CC[C@]4(C)C3CC[C@]12C)C(C)=O
InChI Key: InChIKey=URXWVWVPMJSAJD-ZKPFAEEDSA-N
Data: 1 IC50
Activity Spreadsheet -- Enzyme Inhibition Constant Data from BindingDB
Found 1 hit for monomerid = 233041
Trg + Lig
Ki
nM
ΔG°
kcal/mole
IC50
nM
Kd
nM
EC50/IC50
nM
koff
s-1
kon
M-1s-1
pHTemp
°C
5-alpha-Reductase (5α-Reductase)
(Homo sapiens (Human))
BDBM233041
(3,20-Dioxopregna-4,6-dien-17α-yl acetate (7))
Show SMILES CC(=O)O[C@@]1(CCC2C3C=CC4=CC(=O)CC[C@]4(C)C3CC[C@]12C)C(C)=O |r,c:9,t:11|
Show InChI InChI=1S/C23H30O4/c1-14(24)23(27-15(2)25)12-9-20-18-6-5-16-13-17(26)7-10-21(16,3)19(18)8-11-22(20,23)4/h5-6,13,18-20H,7-12H2,1-4H3/t18?,19?,20?,21-,22-,23-/m0/s1
n/an/a 70n/an/an/an/a6.537
Universidad Nacional Autónoma de México
Assay Description
The reaction mixture contained a final volume of 1 mL: 1 mM dithiothreitol, sodium phosphate buffer 40 mM, at pH 6.5 for human prostate, 2 mM NADPH, ...
J Enzyme Inhib Med Chem 25: 306-11 (2010)
Article DOI: 10.3109/14756360903179401
BindingDB Entry DOI: 10.7270/Q2G15ZQ6