BDBM233066 mtFabH inhibitor, 20
SMILES: CC1=C(O)C(C)(Cc2ccc(cc2)-c2ccc(C)cc2)SC1=O
InChI Key: InChIKey=QVKCOYAILHTVFJ-UHFFFAOYSA-N
Data: 1 IC50
Activity Spreadsheet -- Enzyme Inhibition Constant Data from BindingDB
Found 1 hit for monomerid = 233066
Trg + Lig
Ki
nM
ΔG°
kcal/mole
IC50
nM
Kd
nM
EC50/IC50
nM
koff
s-1
kon
M-1s-1
pHTemp
°C
β-Ketoacyl-acyl carrier protein (ACP) synthase III (FabH)
(Mycobacterium tuberculosis)
BDBM233066
(mtFabH inhibitor, 20)
Show SMILES CC1=C(O)C(C)(Cc2ccc(cc2)-c2ccc(C)cc2)SC1=O |c:1|
Show InChI InChI=1S/C20H20O2S/c1-13-4-8-16(9-5-13)17-10-6-15(7-11-17)12-20(3)18(21)14(2)19(22)23-20/h4-11,21H,12H2,1-3H3
n/an/a 5.20E+4n/an/an/an/an/an/a
China Pharmaceutical University
Assay Description
The biological activities of the compounds were evaluated in the same laboratory. Biological activities measured as IC50 were converted to pIC50 (...
J Enzyme Inhib Med Chem 25: 240-9 (2010)
Article DOI: 10.3109/14756360903049059
BindingDB Entry DOI: 10.7270/Q22R3QJT