BDBM233067 mtFabH inhibitor, 21
SMILES: CC1=C(O)C(C)(Cc2ccc(cc2)-c2ccc(cc2)C(C)(C)C)SC1=O
InChI Key: InChIKey=QGARMLQCHSHKGT-UHFFFAOYSA-N
Data: 1 IC50
Activity Spreadsheet -- Enzyme Inhibition Constant Data from BindingDB
Found 1 hit for monomerid = 233067
Trg + Lig
Ki
nM
ΔG°
kcal/mole
IC50
nM
Kd
nM
EC50/IC50
nM
koff
s-1
kon
M-1s-1
pHTemp
°C
β-Ketoacyl-acyl carrier protein (ACP) synthase III (FabH)
(Mycobacterium tuberculosis)
BDBM233067
(mtFabH inhibitor, 21)
Show SMILES CC1=C(O)C(C)(Cc2ccc(cc2)-c2ccc(cc2)C(C)(C)C)SC1=O |c:1|
Show InChI InChI=1S/C23H26O2S/c1-15-20(24)23(5,26-21(15)25)14-16-6-8-17(9-7-16)18-10-12-19(13-11-18)22(2,3)4/h6-13,24H,14H2,1-5H3
n/an/a 2.50E+4n/an/an/an/an/an/a
China Pharmaceutical University
Assay Description
The biological activities of the compounds were evaluated in the same laboratory. Biological activities measured as IC50 were converted to pIC50 (...
J Enzyme Inhib Med Chem 25: 240-9 (2010)
Article DOI: 10.3109/14756360903049059
BindingDB Entry DOI: 10.7270/Q22R3QJT