BDBM233087 mtFabH inhibitor, 34
SMILES: CC1=C(O)C(C)(Cc2ccc(cc2)-c2ccc(cc2)-c2ccccc2)SC1=O
InChI Key: InChIKey=KORWPZLFVYKIER-UHFFFAOYSA-N
Data: 1 IC50
Activity Spreadsheet -- Enzyme Inhibition Constant Data from BindingDB
Found 1 hit for monomerid = 233087
Trg + Lig
Ki
nM
ΔG°
kcal/mole
IC50
nM
Kd
nM
EC50/IC50
nM
koff
s-1
kon
M-1s-1
pHTemp
°C
β-Ketoacyl-acyl carrier protein (ACP) synthase III (FabH)
(Mycobacterium tuberculosis)
BDBM233087
(mtFabH inhibitor, 34)
Show SMILES CC1=C(O)C(C)(Cc2ccc(cc2)-c2ccc(cc2)-c2ccccc2)SC1=O |c:1|
Show InChI InChI=1S/C25H22O2S/c1-17-23(26)25(2,28-24(17)27)16-18-8-10-20(11-9-18)22-14-12-21(13-15-22)19-6-4-3-5-7-19/h3-15,26H,16H2,1-2H3
n/an/a 6.80E+4n/an/an/an/an/an/a
China Pharmaceutical University
Assay Description
The biological activities of the compounds were evaluated in the same laboratory. Biological activities measured as IC50 were converted to pIC50 (...
J Enzyme Inhib Med Chem 25: 240-9 (2010)
Article DOI: 10.3109/14756360903049059
BindingDB Entry DOI: 10.7270/Q22R3QJT