BDBM233197 US9346786, 1::US9346786, 5
SMILES: CCN([C@@H]1CN(C[C@H]1c1ccc(Cl)c(Cl)c1)C(=O)C1CCN(CC1)C(=O)C1(C)CC1)C(=O)Oc1ccc(F)cc1
InChI Key: InChIKey=WZOHVHWFEFOENV-JYFHCDHNSA-N
Data: 2 KI
Activity Spreadsheet -- Enzyme Inhibition Constant Data from BindingDB
Found 2 hits for monomerid = 233197
Trg + Lig
Ki
nM
ΔG°
kcal/mole
IC50
nM
Kd
nM
EC50/IC50
nM
koff
s-1
kon
M-1s-1
pHTemp
°C
Neuromedin-K receptor
(Homo sapiens (Human))
BDBM233197
(US9346786, 1 | US9346786, 5)
Show SMILES CCN([C@@H]1CN(C[C@H]1c1ccc(Cl)c(Cl)c1)C(=O)C1CCN(CC1)C(=O)C1(C)CC1)C(=O)Oc1ccc(F)cc1 |r|
Show InChI InChI=1S/C30H34Cl2FN3O4/c1-3-36(29(39)40-22-7-5-21(33)6-8-22)26-18-35(17-23(26)20-4-9-24(31)25(32)16-20)27(37)19-10-14-34(15-11-19)28(38)30(2)12-13-30/h4-9,16,19,23,26H,3,10-15,17-18H2,1-2H3/t23-,26+/m0/s1
Reactome pathway
US Patent
1 -11.4n/an/an/an/an/a7.44
Hoffmann-La Roche Inc.
US Patent
Assay Description
hNK3 receptor binding experiment were performed using [3H]SR142801 (Catalog No. TRK1035, specific activity: 74.0 Ci/mmol, Amersham, GE Healthcare UK ...
US Patent US9346786 (2016)
BindingDB Entry DOI: 10.7270/Q20V8BPC
Neuromedin-K receptor
(Homo sapiens (Human))
BDBM233197
(US9346786, 1 | US9346786, 5)
Show SMILES CCN([C@@H]1CN(C[C@H]1c1ccc(Cl)c(Cl)c1)C(=O)C1CCN(CC1)C(=O)C1(C)CC1)C(=O)Oc1ccc(F)cc1 |r|
Show InChI InChI=1S/C30H34Cl2FN3O4/c1-3-36(29(39)40-22-7-5-21(33)6-8-22)26-18-35(17-23(26)20-4-9-24(31)25(32)16-20)27(37)19-10-14-34(15-11-19)28(38)30(2)12-13-30/h4-9,16,19,23,26H,3,10-15,17-18H2,1-2H3/t23-,26+/m0/s1
Reactome pathway
US Patent
2 -11.0n/an/an/an/an/a7.44
Hoffmann-La Roche Inc.
US Patent
Assay Description
hNK3 receptor binding experiment were performed using [3H]SR142801 (Catalog No. TRK1035, specific activity: 74.0 Ci/mmol, Amersham, GE Healthcare UK ...
US Patent US9346786 (2016)
BindingDB Entry DOI: 10.7270/Q20V8BPC