BDBM233243 US9346786, 47
SMILES: CCN([C@@H]1CN(C[C@H]1c1ccc(Cl)c(F)c1)C(=O)C1CCN(CC1)c1ccc(C)cn1)C(=O)Oc1ccc(F)cc1
InChI Key: InChIKey=NJYSVQSHFLGGGI-LBNVMWSVSA-N
Data: 1 KI
Activity Spreadsheet -- Enzyme Inhibition Constant Data from BindingDB
Found 1 hit for monomerid = 233243
Trg + Lig
Ki
nM
ΔG°
kcal/mole
IC50
nM
Kd
nM
EC50/IC50
nM
koff
s-1
kon
M-1s-1
pHTemp
°C
Neuromedin-K receptor
(Homo sapiens (Human))
BDBM233243
(US9346786, 47)
Show SMILES CCN([C@@H]1CN(C[C@H]1c1ccc(Cl)c(F)c1)C(=O)C1CCN(CC1)c1ccc(C)cn1)C(=O)Oc1ccc(F)cc1 |r|
Show InChI InChI=1S/C31H33ClF2N4O3/c1-3-38(31(40)41-24-8-6-23(33)7-9-24)28-19-37(18-25(28)22-5-10-26(32)27(34)16-22)30(39)21-12-14-36(15-13-21)29-11-4-20(2)17-35-29/h4-11,16-17,21,25,28H,3,12-15,18-19H2,1-2H3/t25-,28+/m0/s1
Reactome pathway
US Patent
2 -11.0n/an/an/an/an/a7.44
Hoffmann-La Roche Inc.
US Patent
Assay Description
hNK3 receptor binding experiment were performed using [3H]SR142801 (Catalog No. TRK1035, specific activity: 74.0 Ci/mmol, Amersham, GE Healthcare UK ...
US Patent US9346786 (2016)
BindingDB Entry DOI: 10.7270/Q20V8BPC