BDBM23331 3,3-dimethyl-1-[(2S)-2-(6-phenylhexanoyl)piperidin-1-yl]pentane-1,2-dione::Pipecolyl ketone, 11d
SMILES: CCC(C)(C)C(=O)C(=O)N1CCCC[C@H]1C(=O)CCCCCc1ccccc1
InChI Key: InChIKey=WFJCJROZXOJFAE-FQEVSTJZSA-N
Data: 1 KI
Activity Spreadsheet -- Enzyme Inhibition Constant Data from BindingDB
Found 1 hit for monomerid = 23331
Trg + Lig
Ki
nM
ΔG°
kcal/mole
IC50
nM
Kd
nM
EC50/IC50
nM
koff
s-1
kon
M-1s-1
pHTemp
°C
Immunophilin FKBP12
(Bos taurus (bovine))
BDBM23331
(3,3-dimethyl-1-[(2S)-2-(6-phenylhexanoyl)piperidin...)
Show SMILES CCC(C)(C)C(=O)C(=O)N1CCCC[C@H]1C(=O)CCCCCc1ccccc1 |r|
Show InChI InChI=1S/C24H35NO3/c1-4-24(2,3)22(27)23(28)25-18-12-11-16-20(25)21(26)17-10-6-9-15-19-13-7-5-8-14-19/h5,7-8,13-14,20H,4,6,9-12,15-18H2,1-3H3/t20-/m0/s1
Reactome pathway
3.00E+3 -6.90n/an/an/an/an/a8.00
Guilford Pharmaceuticals, Inc.
Assay Description
PPIase(Rotamase) activity of FKBP12 was assayed using the peptide N-succinyl Ala-Leu-Pro-Phe p-nitroanilide as substrate. It is based on the observat...
J Med Chem 45: 3558-68 (2002)
Article DOI: 10.1021/jm0200456
BindingDB Entry DOI: 10.7270/Q2GH9G7G