BDBM233312 US9346786, 116
SMILES: CCN([C@@H]1CN(C[C@H]1c1ccc(Cl)c(Cl)c1)C(=O)C1CCN(CC1)c1ccc(cn1)C(C)=O)C(=O)Oc1ccc(F)cc1
InChI Key: InChIKey=MBEFXMMFCSKMMQ-LITSAYRRSA-N
Data: 1 KI
Activity Spreadsheet -- Enzyme Inhibition Constant Data from BindingDB
Found 1 hit for monomerid = 233312
Trg + Lig
Ki
nM
ΔG°
kcal/mole
IC50
nM
Kd
nM
EC50/IC50
nM
koff
s-1
kon
M-1s-1
pHTemp
°C
Neuromedin-K receptor
(Homo sapiens (Human))
BDBM233312
(US9346786, 116)
Show SMILES CCN([C@@H]1CN(C[C@H]1c1ccc(Cl)c(Cl)c1)C(=O)C1CCN(CC1)c1ccc(cn1)C(C)=O)C(=O)Oc1ccc(F)cc1 |r|
Show InChI InChI=1S/C32H33Cl2FN4O4/c1-3-39(32(42)43-25-8-6-24(35)7-9-25)29-19-38(18-26(29)22-4-10-27(33)28(34)16-22)31(41)21-12-14-37(15-13-21)30-11-5-23(17-36-30)20(2)40/h4-11,16-17,21,26,29H,3,12-15,18-19H2,1-2H3/t26-,29+/m0/s1
Reactome pathway
US Patent
0.5 -11.8n/an/an/an/an/a7.44
Hoffmann-La Roche Inc.
US Patent
Assay Description
hNK3 receptor binding experiment were performed using [3H]SR142801 (Catalog No. TRK1035, specific activity: 74.0 Ci/mmol, Amersham, GE Healthcare UK ...
US Patent US9346786 (2016)
BindingDB Entry DOI: 10.7270/Q20V8BPC