BDBM23349 1-(4-bromophenyl)-2-{4,6-dimethoxy-12-oxo-11,17-diazatetracyclo[11.3.1.0^{2,11}.0^{3,8}]heptadeca-3(8),4,6-trien-17-yl}ethane-1,2-dione::Tetracyclic aza-amide, 6e
SMILES: COc1cc2CCN3C(C4CCCC(N4C(=O)C(=O)c4ccc(Br)cc4)C3=O)c2c(OC)c1
InChI Key: InChIKey=DUUVKPMROQUTCS-UHFFFAOYSA-N
Data: 1 KI
Activity Spreadsheet -- Enzyme Inhibition Constant Data from BindingDB
Found 1 hit for monomerid = 23349
Trg + Lig
Ki
nM
ΔG°
kcal/mole
IC50
nM
Kd
nM
EC50/IC50
nM
koff
s-1
kon
M-1s-1
pHTemp
°C
Peptidyl-prolyl cis-trans isomerase FKBP1A
(Homo sapiens (Human))
BDBM23349
(1-(4-bromophenyl)-2-{4,6-dimethoxy-12-oxo-11,17-di...)
Show SMILES COc1cc2CCN3C(C4CCCC(N4C(=O)C(=O)c4ccc(Br)cc4)C3=O)c2c(OC)c1 |TLB:15:14:10.11.12:7.8.26|
Show InChI InChI=1S/C25H25BrN2O5/c1-32-17-12-15-10-11-27-22(21(15)20(13-17)33-2)18-4-3-5-19(24(27)30)28(18)25(31)23(29)14-6-8-16(26)9-7-14/h6-9,12-13,18-19,22H,3-5,10-11H2,1-2H3
NCI pathway
Reactome pathway
71 -9.42n/an/an/an/an/a8.015
Pfizer
Assay Description
PPIase(Rotamase) activity of FKBP12 was assayed using the peptide N-succinyl Ala-Leu-Pro-Phe p-nitroanilide as substrate. It is based on the observat...
J Med Chem 49: 1202-6 (2006)
Article DOI: 10.1021/jm049161u
BindingDB Entry DOI: 10.7270/Q2BR8QG9