BDBM23356 1-{4,6-dimethoxy-12-oxo-11,17-diazatetracyclo[11.3.1.0^{2,11}.0^{3,8}]heptadeca-3(8),4,6-trien-17-yl}-2-(2-hydroxyphenyl)ethane-1,2-dione::Tetracyclic aza-amide, 6l
SMILES: COc1cc2CCN3C(C4CCCC(N4C(=O)C(=O)c4ccccc4O)C3=O)c2c(OC)c1
InChI Key: InChIKey=BARFVEBATVBYQH-UHFFFAOYSA-N
Data: 1 KI
Activity Spreadsheet -- Enzyme Inhibition Constant Data from BindingDB
Found 1 hit for monomerid = 23356
Trg + Lig
Ki
nM
ΔG°
kcal/mole
IC50
nM
Kd
nM
EC50/IC50
nM
koff
s-1
kon
M-1s-1
pHTemp
°C
Peptidyl-prolyl cis-trans isomerase FKBP1A
(Homo sapiens (Human))
BDBM23356
(1-{4,6-dimethoxy-12-oxo-11,17-diazatetracyclo[11.3...)
Show SMILES COc1cc2CCN3C(C4CCCC(N4C(=O)C(=O)c4ccccc4O)C3=O)c2c(OC)c1 |TLB:15:14:10.11.12:7.8.26|
Show InChI InChI=1S/C25H26N2O6/c1-32-15-12-14-10-11-26-22(21(14)20(13-15)33-2)17-7-5-8-18(24(26)30)27(17)25(31)23(29)16-6-3-4-9-19(16)28/h3-4,6,9,12-13,17-18,22,28H,5,7-8,10-11H2,1-2H3
NCI pathway
Reactome pathway
238 -8.73n/an/an/an/an/a8.015
Pfizer
Assay Description
PPIase(Rotamase) activity of FKBP12 was assayed using the peptide N-succinyl Ala-Leu-Pro-Phe p-nitroanilide as substrate. It is based on the observat...
J Med Chem 49: 1202-6 (2006)
Article DOI: 10.1021/jm049161u
BindingDB Entry DOI: 10.7270/Q2BR8QG9