BDBM234358 2-Allyl-1-ethoxy-4-methoxybenzene (4b)
SMILES: CCOc1ccc(OC)cc1CC=C
InChI Key: InChIKey=OCNJJFYYINZWNX-UHFFFAOYSA-N
Data: 1 KI  1 IC50
Activity Spreadsheet -- Enzyme Inhibition Constant Data from BindingDB
Found 1 hit for monomerid = 234358
Trg + Lig
Ki
nM
ΔG°
kcal/mole
IC50
nM
Kd
nM
EC50/IC50
nM
koff
s-1
kon
M-1s-1
pHTemp
°C
15-Lipoxygenase (SLO)
(Glycine max (Soybean))
BDBM234358
(2-Allyl-1-ethoxy-4-methoxybenzene (4b))
Show SMILES CCOc1ccc(OC)cc1CC=C
Show InChI InChI=1S/C12H16O2/c1-4-6-10-9-11(13-3)7-8-12(10)14-5-2/h4,7-9H,1,5-6H2,2-3H3
2.72E+4 -5.72 9.11E+4n/an/an/an/a9.01
Mashhad University of Medical Sciences
Assay Description
Lipoxygenase activity was measured in borate buffer solutions (0.1 M, pH 9) using the method described in the literature [Malterud et al., J. Agric. ...
J Enzyme Inhib Med Chem 26: 238-44 (2011)
Article DOI: 10.3109/14756366.2010.495717
BindingDB Entry DOI: 10.7270/Q25D8QQF