BDBM234361 2-Allyl-1-butoxy-4-methoxybenzene (4e)
SMILES: CCCCOc1ccc(OC)cc1CC=C
InChI Key: InChIKey=AXDLEHLSXAXGHU-UHFFFAOYSA-N
Data: 1 KI  1 IC50
Activity Spreadsheet -- Enzyme Inhibition Constant Data from BindingDB
Found 1 hit for monomerid = 234361
Trg + Lig
Ki
nM
ΔG°
kcal/mole
IC50
nM
Kd
nM
EC50/IC50
nM
koff
s-1
kon
M-1s-1
pHTemp
°C
15-Lipoxygenase (SLO)
(Glycine max (Soybean))
BDBM234361
(2-Allyl-1-butoxy-4-methoxybenzene (4e))
Show SMILES CCCCOc1ccc(OC)cc1CC=C
Show InChI InChI=1S/C14H20O2/c1-4-6-10-16-14-9-8-13(15-3)11-12(14)7-5-2/h5,8-9,11H,2,4,6-7,10H2,1,3H3
1.72E+4 -5.97 5.86E+4n/an/an/an/a9.01
Mashhad University of Medical Sciences
Assay Description
Lipoxygenase activity was measured in borate buffer solutions (0.1 M, pH 9) using the method described in the literature [Malterud et al., J. Agric. ...
J Enzyme Inhib Med Chem 26: 238-44 (2011)
Article DOI: 10.3109/14756366.2010.495717
BindingDB Entry DOI: 10.7270/Q25D8QQF