BDBM234362 2-Allyl-1-sec-butoxy-4-methoxybenzene (4f)
SMILES: CCC(C)Oc1ccc(OC)cc1CC=C
InChI Key: InChIKey=WKQMZVGJDIQHLM-UHFFFAOYSA-N
Data: 1 KI  1 IC50
Activity Spreadsheet -- Enzyme Inhibition Constant Data from BindingDB
Found 1 hit for monomerid = 234362
Trg + Lig
Ki
nM
ΔG°
kcal/mole
IC50
nM
Kd
nM
EC50/IC50
nM
koff
s-1
kon
M-1s-1
pHTemp
°C
15-Lipoxygenase (SLO)
(Glycine max (Soybean))
BDBM234362
(2-Allyl-1-sec-butoxy-4-methoxybenzene (4f))
Show SMILES CCC(C)Oc1ccc(OC)cc1CC=C
Show InChI InChI=1S/C14H20O2/c1-5-7-12-10-13(15-4)8-9-14(12)16-11(3)6-2/h5,8-11H,1,6-7H2,2-4H3
7.91E+3 -6.40 2.08E+4n/an/an/an/a9.01
Mashhad University of Medical Sciences
Assay Description
Lipoxygenase activity was measured in borate buffer solutions (0.1 M, pH 9) using the method described in the literature [Malterud et al., J. Agric. ...
J Enzyme Inhib Med Chem 26: 238-44 (2011)
Article DOI: 10.3109/14756366.2010.495717
BindingDB Entry DOI: 10.7270/Q25D8QQF