BDBM234535 US9353089, 221
SMILES: COc1ccc(cc1)C1(NC(=N)N(CC2CCCCC2)C1=O)c1ccc(OC)cc1
InChI Key: InChIKey=OJQMFTWVKXBCBC-UHFFFAOYSA-N
Data: 2 IC50
Activity Spreadsheet -- Enzyme Inhibition Constant Data from BindingDB
Found 2 hits for monomerid = 234535
Trg + Lig
Ki
nM
ΔG°
kcal/mole
IC50
nM
Kd
nM
EC50/IC50
nM
koff
s-1
kon
M-1s-1
pHTemp
°C
Beta-secretase 1
(Homo sapiens (Human))
BDBM234535
(US9353089, 221)
Show SMILES COc1ccc(cc1)C1(NC(=N)N(CC2CCCCC2)C1=O)c1ccc(OC)cc1
Show InChI InChI=1S/C24H29N3O3/c1-29-20-12-8-18(9-13-20)24(19-10-14-21(30-2)15-11-19)22(28)27(23(25)26-24)16-17-6-4-3-5-7-17/h8-15,17H,3-7,16H2,1-2H3,(H2,25,26)
US Patent
n/an/a 6.01E+3n/an/an/an/a4.025
Saint Louis University; Guangzhou Institutes of Biomedicine and Health, Chinese Academy of Sciences
US Patent
Assay Description
The recombinant human BACE1, Cathepsin D, and Cathepsin E enzymes were purchased from R&D Systems (catalog numbers are 931-AS, 1014AS and 1294AS, res...
US Patent US9353089 (2016)
BindingDB Entry DOI: 10.7270/Q2GQ6WP6
Plasmepsin 2
(Plasmodium falciparum)
BDBM234535
(US9353089, 221)
Show SMILES COc1ccc(cc1)C1(NC(=N)N(CC2CCCCC2)C1=O)c1ccc(OC)cc1
Show InChI InChI=1S/C24H29N3O3/c1-29-20-12-8-18(9-13-20)24(19-10-14-21(30-2)15-11-19)22(28)27(23(25)26-24)16-17-6-4-3-5-7-17/h8-15,17H,3-7,16H2,1-2H3,(H2,25,26)
US Patent
n/an/a 2.39n/an/an/an/a4.525
Saint Louis University; Guangzhou Institutes of Biomedicine and Health, Chinese Academy of Sciences
US Patent
Assay Description
Plasmepsin-2 (PM-2; Plm II) and Plasmepsin (PM-4; Plm IV) expression and purification was performed following the published protocols (Istvan E S and...
US Patent US9353089 (2016)
BindingDB Entry DOI: 10.7270/Q2GQ6WP6