null
SMILES: COc1ccc(cc1)C1(NC(=N)N(CC2CCN(CC2)C(=O)OC(C)(C)C)C1=O)c1ccc(OC)cc1
InChI Key: InChIKey=FHVISDKTJAQQPR-UHFFFAOYSA-N
Activity Spreadsheet -- Enzyme Inhibition Constant Data from BindingDB
Found 2 hits for monomerid = 234549
Trg + Lig
Ki
nM
ΔG°
kcal/mole
IC50
nM
Kd
nM
EC50/IC50
nM
koff
s-1
kon
M-1s-1
pHTemp
°C
Beta-secretase 1
(Homo sapiens (Human))
BDBM234549
(US9353089, 313)
Show SMILES COc1ccc(cc1)C1(NC(=N)N(CC2CCN(CC2)C(=O)OC(C)(C)C)C1=O)c1ccc(OC)cc1
Show InChI InChI=1S/C28H36N4O5/c1-27(2,3)37-26(34)31-16-14-19(15-17-31)18-32-24(33)28(30-25(32)29,20-6-10-22(35-4)11-7-20)21-8-12-23(36-5)13-9-21/h6-13,19H,14-18H2,1-5H3,(H2,29,30)
US Patent
n/an/a 2.20E+3n/an/an/an/a4.025
Saint Louis University; Guangzhou Institutes of Biomedicine and Health, Chinese Academy of Sciences
US Patent
Assay Description
The recombinant human BACE1, Cathepsin D, and Cathepsin E enzymes were purchased from R&D Systems (catalog numbers are 931-AS, 1014AS and 1294AS, res...
US Patent US9353089 (2016)
BindingDB Entry DOI: 10.7270/Q2GQ6WP6
Plasmepsin II
(Plasmodium falciparum)
BDBM234549
(US9353089, 313)
Show SMILES COc1ccc(cc1)C1(NC(=N)N(CC2CCN(CC2)C(=O)OC(C)(C)C)C1=O)c1ccc(OC)cc1
Show InChI InChI=1S/C28H36N4O5/c1-27(2,3)37-26(34)31-16-14-19(15-17-31)18-32-24(33)28(30-25(32)29,20-6-10-22(35-4)11-7-20)21-8-12-23(36-5)13-9-21/h6-13,19H,14-18H2,1-5H3,(H2,29,30)
US Patent
n/an/a 11n/an/an/an/a4.525
Saint Louis University; Guangzhou Institutes of Biomedicine and Health, Chinese Academy of Sciences
US Patent
Assay Description
Plasmepsin-2 (PM-2; Plm II) and Plasmepsin (PM-4; Plm IV) expression and purification was performed following the published protocols (Istvan E S and...
US Patent US9353089 (2016)
BindingDB Entry DOI: 10.7270/Q2GQ6WP6