null
SMILES: COc1ccc(cc1)C1(NC(=N)N(C2CCN(CC2)C(C)=O)C1=O)c1ccc(OC)cc1
InChI Key: InChIKey=FBXXOKJXOKYINU-UHFFFAOYSA-N
Activity Spreadsheet -- Enzyme Inhibition Constant Data from BindingDB
Found 2 hits for monomerid = 234564
Trg + Lig
Ki
nM
ΔG°
kcal/mole
IC50
nM
Kd
nM
EC50/IC50
nM
koff
s-1
kon
M-1s-1
pHTemp
°C
Beta-secretase 1
(Homo sapiens (Human))
BDBM234564
(US9353089, 310)
Show SMILES COc1ccc(cc1)C1(NC(=N)N(C2CCN(CC2)C(C)=O)C1=O)c1ccc(OC)cc1
Show InChI InChI=1S/C24H28N4O4/c1-16(29)27-14-12-19(13-15-27)28-22(30)24(26-23(28)25,17-4-8-20(31-2)9-5-17)18-6-10-21(32-3)11-7-18/h4-11,19H,12-15H2,1-3H3,(H2,25,26)
US Patent
n/an/a 2.60E+3n/an/an/an/a4.025
Saint Louis University; Guangzhou Institutes of Biomedicine and Health, Chinese Academy of Sciences
US Patent
Assay Description
The recombinant human BACE1, Cathepsin D, and Cathepsin E enzymes were purchased from R&D Systems (catalog numbers are 931-AS, 1014AS and 1294AS, res...
US Patent US9353089 (2016)
BindingDB Entry DOI: 10.7270/Q2GQ6WP6
Plasmepsin II
(Plasmodium falciparum)
BDBM234564
(US9353089, 310)
Show SMILES COc1ccc(cc1)C1(NC(=N)N(C2CCN(CC2)C(C)=O)C1=O)c1ccc(OC)cc1
Show InChI InChI=1S/C24H28N4O4/c1-16(29)27-14-12-19(13-15-27)28-22(30)24(26-23(28)25,17-4-8-20(31-2)9-5-17)18-6-10-21(32-3)11-7-18/h4-11,19H,12-15H2,1-3H3,(H2,25,26)
US Patent
n/an/a 5.84n/an/an/an/a4.525
Saint Louis University; Guangzhou Institutes of Biomedicine and Health, Chinese Academy of Sciences
US Patent
Assay Description
Plasmepsin-2 (PM-2; Plm II) and Plasmepsin (PM-4; Plm IV) expression and purification was performed following the published protocols (Istvan E S and...
US Patent US9353089 (2016)
BindingDB Entry DOI: 10.7270/Q2GQ6WP6