BDBM234576 US9353089, Table 8, Compound 1
SMILES: CCC(CN1C(=N)NC(C1=O)(c1ccccc1)c1ccccc1)c1ccccc1
InChI Key: InChIKey=PSNGTIQWNUJCAN-UHFFFAOYSA-N
Data: 5 IC50
Activity Spreadsheet -- Enzyme Inhibition Constant Data from BindingDB
Found 5 hits for monomerid = 234576
Trg + Lig
Ki
nM
ΔG°
kcal/mole
IC50
nM
Kd
nM
EC50/IC50
nM
koff
s-1
kon
M-1s-1
pHTemp
°C
Plasmepsin II
(Plasmodium falciparum)
BDBM234576
(US9353089, Table 8, Compound 1)
Show SMILES CCC(CN1C(=N)NC(C1=O)(c1ccccc1)c1ccccc1)c1ccccc1 |w:2.1|
Show InChI InChI=1S/C25H25N3O/c1-2-19(20-12-6-3-7-13-20)18-28-23(29)25(27-24(28)26,21-14-8-4-9-15-21)22-16-10-5-11-17-22/h3-17,19H,2,18H2,1H3,(H2,26,27)
US Patent
n/an/a 12n/an/an/an/a4.525
Saint Louis University; Guangzhou Institutes of Biomedicine and Health, Chinese Academy of Sciences
US Patent
Assay Description
Plasmepsin-2 (PM-2; Plm II) and Plasmepsin (PM-4; Plm IV) expression and purification was performed following the published protocols (Istvan E S and...
US Patent US9353089 (2016)
BindingDB Entry DOI: 10.7270/Q2GQ6WP6
Plasmepsin IV [1-448]
(Plasmodium falciparum)
BDBM234576
(US9353089, Table 8, Compound 1)
Show SMILES CCC(CN1C(=N)NC(C1=O)(c1ccccc1)c1ccccc1)c1ccccc1 |w:2.1|
Show InChI InChI=1S/C25H25N3O/c1-2-19(20-12-6-3-7-13-20)18-28-23(29)25(27-24(28)26,21-14-8-4-9-15-21)22-16-10-5-11-17-22/h3-17,19H,2,18H2,1H3,(H2,26,27)
US Patent
n/an/a 45n/an/an/an/a4.525
Saint Louis University; Guangzhou Institutes of Biomedicine and Health, Chinese Academy of Sciences
US Patent
Assay Description
Plasmepsin-2 (PM-2; Plm II) and Plasmepsin (PM-4; Plm IV) expression and purification was performed following the published protocols (Istvan E S and...
US Patent US9353089 (2016)
BindingDB Entry DOI: 10.7270/Q2GQ6WP6
Cathepsin E
(Homo sapiens (Human))
BDBM234576
(US9353089, Table 8, Compound 1)
Show SMILES CCC(CN1C(=N)NC(C1=O)(c1ccccc1)c1ccccc1)c1ccccc1 |w:2.1|
Show InChI InChI=1S/C25H25N3O/c1-2-19(20-12-6-3-7-13-20)18-28-23(29)25(27-24(28)26,21-14-8-4-9-15-21)22-16-10-5-11-17-22/h3-17,19H,2,18H2,1H3,(H2,26,27)
US Patent
n/an/a 99n/an/an/an/a4.025
Saint Louis University; Guangzhou Institutes of Biomedicine and Health, Chinese Academy of Sciences
US Patent
Assay Description
The recombinant human BACE1, Cathepsin D, and Cathepsin E enzymes were purchased from R&D Systems (catalog numbers are 931-AS, 1014AS and 1294AS, res...
US Patent US9353089 (2016)
BindingDB Entry DOI: 10.7270/Q2GQ6WP6
Cathepsin D
(Homo sapiens (Human))
BDBM234576
(US9353089, Table 8, Compound 1)
Show SMILES CCC(CN1C(=N)NC(C1=O)(c1ccccc1)c1ccccc1)c1ccccc1 |w:2.1|
Show InChI InChI=1S/C25H25N3O/c1-2-19(20-12-6-3-7-13-20)18-28-23(29)25(27-24(28)26,21-14-8-4-9-15-21)22-16-10-5-11-17-22/h3-17,19H,2,18H2,1H3,(H2,26,27)
NCI pathway
Reactome pathway
US Patent
n/an/a 385n/an/an/an/a4.025
Saint Louis University; Guangzhou Institutes of Biomedicine and Health, Chinese Academy of Sciences
US Patent
Assay Description
The recombinant human BACE1, Cathepsin D, and Cathepsin E enzymes were purchased from R&D Systems (catalog numbers are 931-AS, 1014AS and 1294AS, res...
US Patent US9353089 (2016)
BindingDB Entry DOI: 10.7270/Q2GQ6WP6
Beta-secretase 1
(Homo sapiens (Human))
BDBM234576
(US9353089, Table 8, Compound 1)
Show SMILES CCC(CN1C(=N)NC(C1=O)(c1ccccc1)c1ccccc1)c1ccccc1 |w:2.1|
Show InChI InChI=1S/C25H25N3O/c1-2-19(20-12-6-3-7-13-20)18-28-23(29)25(27-24(28)26,21-14-8-4-9-15-21)22-16-10-5-11-17-22/h3-17,19H,2,18H2,1H3,(H2,26,27)
US Patent
n/an/a 2.30E+3n/an/an/an/a4.025
Saint Louis University; Guangzhou Institutes of Biomedicine and Health, Chinese Academy of Sciences
US Patent
Assay Description
The recombinant human BACE1, Cathepsin D, and Cathepsin E enzymes were purchased from R&D Systems (catalog numbers are 931-AS, 1014AS and 1294AS, res...
US Patent US9353089 (2016)
BindingDB Entry DOI: 10.7270/Q2GQ6WP6