null
SMILES: COC(=O)[C@@]1(C[C@H]1C(=O)NO)c1cccc(OCc2cccc(c2)C(F)(F)F)c1
InChI Key: InChIKey=HFBCDWUJKHOSLS-LPHOPBHVSA-N
Activity Spreadsheet -- Enzyme Inhibition Constant Data from BindingDB
Found 1 hit for monomerid = 23463
Trg + Lig
Ki
nM
ΔG°
kcal/mole
IC50
nM
Kd
nM
EC50/IC50
nM
koff
s-1
kon
M-1s-1
pHTemp
°C
Disintegrin and metalloproteinase domain-containing protein 17 [215-477,S266A,N452Q]
(Homo sapiens (Human))
BDBM23463
(hydroxamate deriv., 55 | methyl (1R,2R)-2-(hydroxy...)
Show SMILES COC(=O)[C@@]1(C[C@H]1C(=O)NO)c1cccc(OCc2cccc(c2)C(F)(F)F)c1 |r|
Show InChI InChI=1S/C20H18F3NO5/c1-28-18(26)19(10-16(19)17(25)24-27)13-5-3-7-15(9-13)29-11-12-4-2-6-14(8-12)20(21,22)23/h2-9,16,27H,10-11H2,1H3,(H,24,25)/t16-,19-/m0/s1
70 -9.66n/an/an/an/an/a7.322
Schering-Plough Research Institute
Assay Description
Enzyme activity was determined by a kinetic assay measuring the rate of increase in fluorescent intensity generated by the cleavage of an internally ...
J Med Chem 51: 725-36 (2008)
Article DOI: 10.1021/jm070376o
BindingDB Entry DOI: 10.7270/Q2Q23XKR