null
SMILES: COc1ncc(cc1-c1ccc(nc1CN1[C@@H](C)[C@H](OC1=O)c1cc(cc(c1)C(F)(F)F)C(F)(F)F)N1CC(F)(F)C1)-c1c(C)cc(cc1C)C(=O)OC(C)(C)C
InChI Key: InChIKey=AHXBWNPYGZETFZ-KATKFWMUSA-N
Activity Spreadsheet -- Enzyme Inhibition Constant Data from BindingDB
Found 1 hit for monomerid = 234661
Trg + Lig
Ki
nM
ΔG°
kcal/mole
IC50
nM
Kd
nM
EC50/IC50
nM
koff
s-1
kon
M-1s-1
pHTemp
°C
Cholesteryl ester transfer protein
(Homo sapiens (Human))
BDBM234661
(US9353101, 57)
Show SMILES COc1ncc(cc1-c1ccc(nc1CN1[C@@H](C)[C@H](OC1=O)c1cc(cc(c1)C(F)(F)F)C(F)(F)F)N1CC(F)(F)C1)-c1c(C)cc(cc1C)C(=O)OC(C)(C)C |r|
Show InChI InChI=1S/C40H38F8N4O5/c1-20-10-24(35(53)57-37(4,5)6)11-21(2)32(20)25-14-29(34(55-7)49-16-25)28-8-9-31(51-18-38(41,42)19-51)50-30(28)17-52-22(3)33(56-36(52)54)23-12-26(39(43,44)45)15-27(13-23)40(46,47)48/h8-16,22,33H,17-19H2,1-7H3/t22-,33-/m0/s1
Reactome pathway
US Patent
n/an/a 5n/an/an/an/a7.437
Merck Sharp & Dohme Corp.
US Patent
Assay Description
Radiolabeled donor particles are generated by first combining 100 μl of 200 μM butylated hydroxyl toluene in CHCl3, 216 μL of 21.57 mM DOPC ...
US Patent US9353101 (2016)
BindingDB Entry DOI: 10.7270/Q2765D7V