BDBM235032 US9556168, 10B
SMILES: OC(=O)c1cc(F)c(cc1O)-c1nn(Cc2c(Cl)cccc2C(F)(F)F)c2cc(cc(F)c12)C(=O)N1CCC1
InChI Key: InChIKey=UKVVZLDCTZVQIU-UHFFFAOYSA-N
Data: 1 IC50
Activity Spreadsheet -- Enzyme Inhibition Constant Data from BindingDB
Found 1 hit for monomerid = 235032
Trg + Lig
Ki
nM
ΔG°
kcal/mole
IC50
nM
Kd
nM
EC50/IC50
nM
koff
s-1
kon
M-1s-1
pHTemp
°C
Nuclear receptor ROR-gamma (RORC)
(Homo sapiens (Human))
BDBM235032
(US9556168, 10B)
Show SMILES OC(=O)c1cc(F)c(cc1O)-c1nn(Cc2c(Cl)cccc2C(F)(F)F)c2cc(cc(F)c12)C(=O)N1CCC1
Show InChI InChI=1S/C26H17ClF5N3O4/c27-17-4-1-3-16(26(30,31)32)15(17)11-35-20-8-12(24(37)34-5-2-6-34)7-19(29)22(20)23(33-35)13-10-21(36)14(25(38)39)9-18(13)28/h1,3-4,7-10,36H,2,5-6,11H2,(H,38,39)
US Patent
n/an/a 1n/an/an/an/a7.0n/a
Merck Sharp & Dohme Corp.
US Patent
Assay Description
The compounds of the invention inhibit RORgammaT activity. Activation of RORgammaT activity can be measured using, e.g., biochemical TR-FRET assay. I...
US Patent US9556168 (2017)
BindingDB Entry DOI: 10.7270/Q2D220MV