BDBM23529 2-{3-[2-(4-hydroxy-1H-pyrazol-1-yl)-1,3-thiazol-5-yl]propanamido}benzoic acid::Biaryl Anthranilide Analogue, 2k
SMILES: OC(=O)c1ccccc1NC(=O)CCc1cnc(s1)-n1cc(O)cn1
InChI Key: InChIKey=CBQCLKNVINQXIV-UHFFFAOYSA-N
Data: 1 IC50  1 EC50
Activity Spreadsheet -- Enzyme Inhibition Constant Data from BindingDB
Found 1 hit for monomerid = 23529
Trg + Lig
Ki
nM
ΔG°
kcal/mole
IC50
nM
Kd
nM
EC50/IC50
nM
koff
s-1
kon
M-1s-1
pHTemp
°C
Hydroxycarboxylic acid receptor 2
(Homo sapiens (Human))
BDBM23529
(2-{3-[2-(4-hydroxy-1H-pyrazol-1-yl)-1,3-thiazol-5-...)
Show SMILES OC(=O)c1ccccc1NC(=O)CCc1cnc(s1)-n1cc(O)cn1
Show InChI InChI=1S/C16H14N4O4S/c21-10-7-18-20(9-10)16-17-8-11(25-16)5-6-14(22)19-13-4-2-1-3-12(13)15(23)24/h1-4,7-9,21H,5-6H2,(H,19,22)(H,23,24)
Reactome pathway
n/an/a 20n/a 240n/an/a7.423
Merck Research Laboratories
Assay Description
Membranes were incubated in binding buffer with [5, 6-3H]-niacin in the presence of test compound. After 4 hours at room temperature, reactions were ...
J Med Chem 50: 6303-6 (2007)
Article DOI: 10.1021/jm700942d
BindingDB Entry DOI: 10.7270/Q29S1PBG