BDBM235789 US9359399, 28
SMILES: CC(C)C[C@@H](NC(=O)[C@@H](Cc1ccccc1)NC(=O)[C@H](N)Cc1ccccc1)C(=O)N[C@H](CCCCN)C(=O)N1CCC(CC1)n1c2ccc(Cl)cc2[nH]c1=O
InChI Key:
Data: 2 EC50
Activity Spreadsheet -- Enzyme Inhibition Constant Data from BindingDB
Found 2 hits for monomerid = 235789
Trg + Lig
Ki
nM
ΔG°
kcal/mole
IC50
nM
Kd
nM
EC50/IC50
nM
koff
s-1
kon
M-1s-1
pHTemp
°C
Kappa-type opioid receptor
(Homo sapiens (Human))
BDBM235789
(US9359399, 28)
Show SMILES CC(C)C[C@@H](NC(=O)[C@@H](Cc1ccccc1)NC(=O)[C@H](N)Cc1ccccc1)C(=O)N[C@H](CCCCN)C(=O)N1CCC(CC1)n1c2ccc(Cl)cc2[nH]c1=O |r|
Reactome pathway
US Patent
n/an/an/an/a 0.00830n/an/an/a25
Cara Therapeutics, Inc.
US Patent
Assay Description
Mouse R1.G1 cells (ATCC, Manassas, Va.) were grown in suspension in high glucose-DMEM (Dulbecco's Modified Eagle's Medium, Cellgro, Herndon, Va.) con...
US Patent US9359399 (2016)
BindingDB Entry DOI: 10.7270/Q23B5Z2C
Kappa-type opioid receptor
(Mus musculus (Mouse))
BDBM235789
(US9359399, 28)
Show SMILES CC(C)C[C@@H](NC(=O)[C@@H](Cc1ccccc1)NC(=O)[C@H](N)Cc1ccccc1)C(=O)N[C@H](CCCCN)C(=O)N1CCC(CC1)n1c2ccc(Cl)cc2[nH]c1=O |r|
US Patent
n/an/an/an/a 0.0582n/an/an/a25
Cara Therapeutics, Inc.
US Patent
Assay Description
Mouse R1.G1 cells (ATCC, Manassas, Va.) were grown in suspension in high glucose-DMEM (Dulbecco's Modified Eagle's Medium, Cellgro, Herndon, Va.) con...
US Patent US9359399 (2016)
BindingDB Entry DOI: 10.7270/Q23B5Z2C