BDBM235823 US9364459, K
SMILES: COc1cc(cc(OC)c1OC)C1=C(C(=O)NC1=O)c1cn(CCCN(C)C)c2ccccc12
InChI Key: InChIKey=PAIIKMRDIHPUKN-UHFFFAOYSA-N
Data: 3 IC50
Activity Spreadsheet -- Enzyme Inhibition Constant Data from BindingDB
Found 3 hits for monomerid = 235823
Trg + Lig
Ki
nM
ΔG°
kcal/mole
IC50
nM
Kd
nM
EC50/IC50
nM
koff
s-1
kon
M-1s-1
pHTemp
°C
Vascular endothelial growth factor receptor 2
(Homo sapiens (Human))
BDBM235823
(US9364459, K)
Show SMILES COc1cc(cc(OC)c1OC)C1=C(C(=O)NC1=O)c1cn(CCCN(C)C)c2ccccc12 |t:13|
Show InChI InChI=1S/C26H29N3O5/c1-28(2)11-8-12-29-15-18(17-9-6-7-10-19(17)29)23-22(25(30)27-26(23)31)16-13-20(32-3)24(34-5)21(14-16)33-4/h6-7,9-10,13-15H,8,11-12H2,1-5H3,(H,27,30,31)
NCI pathway
Reactome pathway
US Patent
n/an/a>1.00E+4n/an/an/an/an/an/a
Johannes Gutenberg-Universität Mainz; Universitätsmedizin der Johannes Gutenberg-Universität Mainz
US Patent
Assay Description
The effect of test compounds on the activity of the protein kinases GSK-3β, VEGFR-2 and FLT-3 was evaluated based on half maximal inhibitory con...
US Patent US9364459 (2016)
BindingDB Entry DOI: 10.7270/Q2ZK5FK2
Glycogen synthase kinase-3 beta
(Homo sapiens (Human))
BDBM235823
(US9364459, K)
Show SMILES COc1cc(cc(OC)c1OC)C1=C(C(=O)NC1=O)c1cn(CCCN(C)C)c2ccccc12 |t:13|
Show InChI InChI=1S/C26H29N3O5/c1-28(2)11-8-12-29-15-18(17-9-6-7-10-19(17)29)23-22(25(30)27-26(23)31)16-13-20(32-3)24(34-5)21(14-16)33-4/h6-7,9-10,13-15H,8,11-12H2,1-5H3,(H,27,30,31)
NCI pathway
Reactome pathway
US Patent
n/an/a>1.00E+3n/an/an/an/an/an/a
Johannes Gutenberg-Universität Mainz; Universitätsmedizin der Johannes Gutenberg-Universität Mainz
US Patent
Assay Description
The effect of test compounds on the activity of the protein kinases GSK-3β, VEGFR-2 and FLT-3 was evaluated based on half maximal inhibitory con...
US Patent US9364459 (2016)
BindingDB Entry DOI: 10.7270/Q2ZK5FK2
Receptor-type tyrosine-protein kinase FLT3
(Homo sapiens (Human))
BDBM235823
(US9364459, K)
Show SMILES COc1cc(cc(OC)c1OC)C1=C(C(=O)NC1=O)c1cn(CCCN(C)C)c2ccccc12 |t:13|
Show InChI InChI=1S/C26H29N3O5/c1-28(2)11-8-12-29-15-18(17-9-6-7-10-19(17)29)23-22(25(30)27-26(23)31)16-13-20(32-3)24(34-5)21(14-16)33-4/h6-7,9-10,13-15H,8,11-12H2,1-5H3,(H,27,30,31)
US Patent
n/an/a 1.53E+3n/an/an/an/an/an/a
Johannes Gutenberg-Universität Mainz; Universitätsmedizin der Johannes Gutenberg-Universität Mainz
US Patent
Assay Description
The effect of test compounds on the activity of the protein kinases GSK-3β, VEGFR-2 and FLT-3 was evaluated based on half maximal inhibitory con...
US Patent US9364459 (2016)
BindingDB Entry DOI: 10.7270/Q2ZK5FK2