null
SMILES: CCCc1nc(C)nn1-c1cc(nc(C)n1)N1CC(C1)c1nc2ccccc2n1C
InChI Key: InChIKey=TVKSLFXRCSIKOI-UHFFFAOYSA-N
Activity Spreadsheet -- Enzyme Inhibition Constant Data from BindingDB
Found 1 hit for monomerid = 236000
Trg + Lig
Ki
nM
ΔG°
kcal/mole
IC50
nM
Kd
nM
EC50/IC50
nM
koff
s-1
kon
M-1s-1
pHTemp
°C
Isoform PDE10A2 of cAMP and cAMP-inhibited cGMP 3',5'-cyclic phosphodiesterase 10A (PDE10A2)
(Homo sapiens (Human))
BDBM236000
(US9365562, 38)
Show SMILES CCCc1nc(C)nn1-c1cc(nc(C)n1)N1CC(C1)c1nc2ccccc2n1C
Show InChI InChI=1S/C22H26N8/c1-5-8-19-25-15(3)27-30(19)21-11-20(23-14(2)24-21)29-12-16(13-29)22-26-17-9-6-7-10-18(17)28(22)4/h6-7,9-11,16H,5,8,12-13H2,1-4H3
US Patent
0.410 -12.8n/an/an/an/an/a7.225
Merck Sharp & Dohme Corp.
US Patent
Assay Description
The fluorescence polarization assay for cyclic nucleotide phosphodiesterases was performed using an IMAP® FP kit supplied by Molecular Devices, S...
US Patent US9365562 (2016)
BindingDB Entry DOI: 10.7270/Q2ST7NQZ