null
SMILES: Cc1nc(Cc2ccc(F)cc2)n(n1)-c1cc(nc(C)n1)N1CC(C1)c1nc2ccccc2n1C
InChI Key: InChIKey=HBMJHPVHFJRLTG-UHFFFAOYSA-N
Activity Spreadsheet -- Enzyme Inhibition Constant Data from BindingDB
Found 1 hit for monomerid = 236020
Trg + Lig
Ki
nM
ΔG°
kcal/mole
IC50
nM
Kd
nM
EC50/IC50
nM
koff
s-1
kon
M-1s-1
pHTemp
°C
Isoform PDE10A2 of cAMP and cAMP-inhibited cGMP 3',5'-cyclic phosphodiesterase 10A (PDE10A2)
(Homo sapiens (Human))
BDBM236020
(US9365562, 58)
Show SMILES Cc1nc(Cc2ccc(F)cc2)n(n1)-c1cc(nc(C)n1)N1CC(C1)c1nc2ccccc2n1C
Show InChI InChI=1S/C26H25FN8/c1-16-28-23(34-14-19(15-34)26-31-21-6-4-5-7-22(21)33(26)3)13-25(29-16)35-24(30-17(2)32-35)12-18-8-10-20(27)11-9-18/h4-11,13,19H,12,14-15H2,1-3H3
US Patent
0.120 -13.5n/an/an/an/an/a7.225
Merck Sharp & Dohme Corp.
US Patent
Assay Description
The fluorescence polarization assay for cyclic nucleotide phosphodiesterases was performed using an IMAP® FP kit supplied by Molecular Devices, S...
US Patent US9365562 (2016)
BindingDB Entry DOI: 10.7270/Q2ST7NQZ