BDBM236261 US9365576, 14
SMILES: COc1ncc(-c2cc3C(=O)N(C(c3n2C(C)C)c2ccc(Cl)cc2)c2cc(Cl)ccc2C)c(OC)n1
InChI Key: InChIKey=YZFOGCNKBSEULT-UHFFFAOYSA-N
Data: 1 IC50
Activity Spreadsheet -- Enzyme Inhibition Constant Data from BindingDB
Found 1 hit for monomerid = 236261
Trg + Lig
Ki
nM
ΔG°
kcal/mole
IC50
nM
Kd
nM
EC50/IC50
nM
koff
s-1
kon
M-1s-1
pHTemp
°C
p53-MDM2
(Homo sapiens (Human))
BDBM236261
(US9365576, 14)
Show SMILES COc1ncc(-c2cc3C(=O)N(C(c3n2C(C)C)c2ccc(Cl)cc2)c2cc(Cl)ccc2C)c(OC)n1
Show InChI InChI=1S/C28H26Cl2N4O3/c1-15(2)33-23(21-14-31-28(37-5)32-26(21)36-4)13-20-25(33)24(17-7-10-18(29)11-8-17)34(27(20)35)22-12-19(30)9-6-16(22)3/h6-15,24H,1-5H3
Reactome pathway
US Patent
n/an/a 0.0680n/an/an/an/an/a25
Novartis AG
US Patent
Assay Description
Assay 2: The test is performed in white 384-well plates (Greiner Bio-One, reference 781207) in a total volume of 60 μL by adding 1 μL of compou...
US Patent US9365576 (2016)
BindingDB Entry DOI: 10.7270/Q2DN43XR