null
SMILES: COc1ncc(-c2cc3C(=O)N(C(c3n2C(C)C)c2ccc(Cl)cc2C)C2CCOCC2)c(OC)n1
InChI Key: InChIKey=TVCFLHMUHMTBGT-UHFFFAOYSA-N
Activity Spreadsheet -- Enzyme Inhibition Constant Data from BindingDB
Found 3 hits for monomerid = 236352
Trg + Lig
Ki
nM
ΔG°
kcal/mole
IC50
nM
Kd
nM
EC50/IC50
nM
koff
s-1
kon
M-1s-1
pHTemp
°C
Cellular tumor antigen p53 [18-26]/E3 ubiquitin-protein ligase Mdm2 [2-188]
(Homo sapiens (Human))
BDBM236352
(US9365576, 105)
Show SMILES COc1ncc(-c2cc3C(=O)N(C(c3n2C(C)C)c2ccc(Cl)cc2C)C2CCOCC2)c(OC)n1
Show InChI InChI=1S/C27H31ClN4O4/c1-15(2)31-22(21-14-29-27(35-5)30-25(21)34-4)13-20-24(31)23(19-7-6-17(28)12-16(19)3)32(26(20)33)18-8-10-36-11-9-18/h6-7,12-15,18,23H,8-11H2,1-5H3
Reactome pathway
US Patent
n/an/a 10.2n/an/an/an/an/a25
Novartis AG
US Patent
Assay Description
Assay 1: The test is performed in white 384-well plates (Greiner Bio-One, reference 781207) in a total volume of 60 μL by adding 1 μL of compou...
US Patent US9365576 (2016)
BindingDB Entry DOI: 10.7270/Q2DN43XR
Cellular tumor antigen p53 [18-26]/E3 ubiquitin-protein ligase Mdm2 [2-188]
(Homo sapiens (Human))
BDBM236352
(US9365576, 105)
Show SMILES COc1ncc(-c2cc3C(=O)N(C(c3n2C(C)C)c2ccc(Cl)cc2C)C2CCOCC2)c(OC)n1
Show InChI InChI=1S/C27H31ClN4O4/c1-15(2)31-22(21-14-29-27(35-5)30-25(21)34-4)13-20-24(31)23(19-7-6-17(28)12-16(19)3)32(26(20)33)18-8-10-36-11-9-18/h6-7,12-15,18,23H,8-11H2,1-5H3
Reactome pathway
US Patent
n/an/a 14.3n/an/an/an/an/a25
Novartis AG
US Patent
Assay Description
Assay 2: The test is performed in white 384-well plates (Greiner Bio-One, reference 781207) in a total volume of 60 μL by adding 1 μL of compou...
US Patent US9365576 (2016)
BindingDB Entry DOI: 10.7270/Q2DN43XR
Cellular tumor antigen p53 [18-26]/Protein Mdm4 [2-185]
(Homo sapiens (Human))
BDBM236352
(US9365576, 105)
Show SMILES COc1ncc(-c2cc3C(=O)N(C(c3n2C(C)C)c2ccc(Cl)cc2C)C2CCOCC2)c(OC)n1
Show InChI InChI=1S/C27H31ClN4O4/c1-15(2)31-22(21-14-29-27(35-5)30-25(21)34-4)13-20-24(31)23(19-7-6-17(28)12-16(19)3)32(26(20)33)18-8-10-36-11-9-18/h6-7,12-15,18,23H,8-11H2,1-5H3
US Patent
n/an/a 6.29E+3n/an/an/an/an/a25
Novartis AG
US Patent
Assay Description
Assay 1: The test is performed in white 384-well plates (Greiner Bio-One, reference 781207) in a total volume of 60 μL by adding 1 μL of compou...
US Patent US9365576 (2016)
BindingDB Entry DOI: 10.7270/Q2DN43XR