BDBM236481 US9365576, 237
SMILES: COc1ncc(-c2cc3C(=O)N([C@H](c3n2C(C)C)c2ccc(C#N)c(F)c2)c2cc(Cl)c(=O)n(C)c2)c(OC)n1
InChI Key: InChIKey=FIXFXNNSCCMJIC-QHCPKHFHSA-N
Data: 1 IC50
Activity Spreadsheet -- Enzyme Inhibition Constant Data from BindingDB
Found 1 hit for monomerid = 236481
Trg + Lig
Ki
nM
ΔG°
kcal/mole
IC50
nM
Kd
nM
EC50/IC50
nM
koff
s-1
kon
M-1s-1
pHTemp
°C
p53-MDM2
(Homo sapiens (Human))
BDBM236481
(US9365576, 237)
Show SMILES COc1ncc(-c2cc3C(=O)N([C@H](c3n2C(C)C)c2ccc(C#N)c(F)c2)c2cc(Cl)c(=O)n(C)c2)c(OC)n1 |r|
Show InChI InChI=1S/C28H24ClFN6O4/c1-14(2)35-22(19-12-32-28(40-5)33-25(19)39-4)10-18-24(35)23(15-6-7-16(11-31)21(30)8-15)36(26(18)37)17-9-20(29)27(38)34(3)13-17/h6-10,12-14,23H,1-5H3/t23-/m0/s1
Reactome pathway
US Patent
n/an/a 0.107n/an/an/an/an/a25
Novartis AG
US Patent
Assay Description
Assay 2: The test is performed in white 384-well plates (Greiner Bio-One, reference 781207) in a total volume of 60 μL by adding 1 μL of compou...
US Patent US9365576 (2016)
BindingDB Entry DOI: 10.7270/Q2DN43XR