BDBM236566 US9365582, 7
SMILES: CCOc1cc(O[C@@H]2C[C@@H]3[C@@H](C2)C(=O)N(C)CCCC\C=C/[C@@H]2C[C@]2(NC3=O)C(=O)NS(=O)(=O)C2CC2)c2ccc(OC)c(Br)c2n1
InChI Key: InChIKey=SMGNMBKPAWFKGH-INOGULINSA-N
Data: 1 KI  1 EC50
Activity Spreadsheet -- Enzyme Inhibition Constant Data from BindingDB
Found 2 hits for monomerid = 236566
Trg + Lig
Ki
nM
ΔG°
kcal/mole
IC50
nM
Kd
nM
EC50/IC50
nM
koff
s-1
kon
M-1s-1
pHTemp
°C
NS3/4A protease
(Hepatitis C virus genotype 1a (strain H77) (HCV))
BDBM236566
(US9365582, 7)
Show SMILES CCOc1cc(O[C@@H]2C[C@@H]3[C@@H](C2)C(=O)N(C)CCCC\C=C/[C@@H]2C[C@]2(NC3=O)C(=O)NS(=O)(=O)C2CC2)c2ccc(OC)c(Br)c2n1 |r,c:21|
Show InChI InChI=1S/C33H41BrN4O8S/c1-4-45-27-17-26(22-12-13-25(44-3)28(34)29(22)35-27)46-20-15-23-24(16-20)31(40)38(2)14-8-6-5-7-9-19-18-33(19,36-30(23)39)32(41)37-47(42,43)21-10-11-21/h7,9,12-13,17,19-21,23-24H,4-6,8,10-11,14-16,18H2,1-3H3,(H,36,39)(H,37,41)/b9-7-/t19-,20-,23-,24-,33-/m1/s1
US Patent
0.100n/an/an/an/an/an/a7.5n/a
Janssen Sciences Ireland UC
US Patent
Assay Description
The inhibition of full-length hepatitis C NS3 protease enzyme was measured essentially as described in Poliakov, 2002 Prot Expression & Purification ...
US Patent US9365582 (2016)
BindingDB Entry DOI: 10.7270/Q2VM4B5G
NS3-NS5B
(Hepatitis C virus genotype 1b (isolate Con1) (HCV))
BDBM236566
(US9365582, 7)
Show SMILES CCOc1cc(O[C@@H]2C[C@@H]3[C@@H](C2)C(=O)N(C)CCCC\C=C/[C@@H]2C[C@]2(NC3=O)C(=O)NS(=O)(=O)C2CC2)c2ccc(OC)c(Br)c2n1 |r,c:21|
Show InChI InChI=1S/C33H41BrN4O8S/c1-4-45-27-17-26(22-12-13-25(44-3)28(34)29(22)35-27)46-20-15-23-24(16-20)31(40)38(2)14-8-6-5-7-9-19-18-33(19,36-30(23)39)32(41)37-47(42,43)21-10-11-21/h7,9,12-13,17,19-21,23-24H,4-6,8,10-11,14-16,18H2,1-3H3,(H,36,39)(H,37,41)/b9-7-/t19-,20-,23-,24-,33-/m1/s1
US Patent
n/an/an/an/a 3.5n/an/an/an/a
Janssen Sciences Ireland UC
US Patent
Assay Description
The assay utilized the stably transfected cell line Huh-7 luc/neo (hereafter referred to as Huh-Luc). This cell line harbors an RNA encoding a bicist...
US Patent US9365582 (2016)
BindingDB Entry DOI: 10.7270/Q2VM4B5G