BDBM236572 US9365582, 14
SMILES: CCOc1cc(O[C@@H]2C[C@@H]3[C@@H](C2)C(=O)N(C)CCCC\C=C/[C@@H]2C[C@]2(NC3=O)C(O)=O)c2ccc3OCOc3c2n1
InChI Key: InChIKey=VARBFZKEJMFXSC-XYNWTZPSSA-N
Data: 1 KI  1 EC50
Activity Spreadsheet -- Enzyme Inhibition Constant Data from BindingDB
Found 2 hits for monomerid = 236572
Trg + Lig
Ki
nM
ΔG°
kcal/mole
IC50
nM
Kd
nM
EC50/IC50
nM
koff
s-1
kon
M-1s-1
pHTemp
°C
NS3/4A protease
(Hepatitis C virus genotype 1a (strain H77) (HCV))
BDBM236572
(US9365582, 14)
Show SMILES CCOc1cc(O[C@@H]2C[C@@H]3[C@@H](C2)C(=O)N(C)CCCC\C=C/[C@@H]2C[C@]2(NC3=O)C(O)=O)c2ccc3OCOc3c2n1 |r,c:21|
Show InChI InChI=1S/C30H35N3O8/c1-3-38-24-14-23(19-9-10-22-26(25(19)31-24)40-16-39-22)41-18-12-20-21(13-18)28(35)33(2)11-7-5-4-6-8-17-15-30(17,29(36)37)32-27(20)34/h6,8-10,14,17-18,20-21H,3-5,7,11-13,15-16H2,1-2H3,(H,32,34)(H,36,37)/b8-6-/t17-,18-,20-,21-,30-/m1/s1
US Patent
58n/an/an/an/an/an/a7.5n/a
Janssen Sciences Ireland UC
US Patent
Assay Description
The inhibition of full-length hepatitis C NS3 protease enzyme was measured essentially as described in Poliakov, 2002 Prot Expression & Purification ...
US Patent US9365582 (2016)
BindingDB Entry DOI: 10.7270/Q2VM4B5G
NS3-NS5B
(Hepatitis C virus genotype 1b (isolate Con1) (HCV))
BDBM236572
(US9365582, 14)
Show SMILES CCOc1cc(O[C@@H]2C[C@@H]3[C@@H](C2)C(=O)N(C)CCCC\C=C/[C@@H]2C[C@]2(NC3=O)C(O)=O)c2ccc3OCOc3c2n1 |r,c:21|
Show InChI InChI=1S/C30H35N3O8/c1-3-38-24-14-23(19-9-10-22-26(25(19)31-24)40-16-39-22)41-18-12-20-21(13-18)28(35)33(2)11-7-5-4-6-8-17-15-30(17,29(36)37)32-27(20)34/h6,8-10,14,17-18,20-21H,3-5,7,11-13,15-16H2,1-2H3,(H,32,34)(H,36,37)/b8-6-/t17-,18-,20-,21-,30-/m1/s1
US Patent
n/an/an/an/a 3.30E+3n/an/an/an/a
Janssen Sciences Ireland UC
US Patent
Assay Description
The assay utilized the stably transfected cell line Huh-7 luc/neo (hereafter referred to as Huh-Luc). This cell line harbors an RNA encoding a bicist...
US Patent US9365582 (2016)
BindingDB Entry DOI: 10.7270/Q2VM4B5G