BDBM236682 US9388140, 23
SMILES: Cc1cc(ccc1C(=O)NC1CC1)-n1cnc2c(NCC3CCOCC3)cc(Oc3ccc(Cl)cc3)cc12
InChI Key: InChIKey=UQAUPFSGPUNTSZ-UHFFFAOYSA-N
Data: 1 IC50
Activity Spreadsheet -- Enzyme Inhibition Constant Data from BindingDB
Found 1 hit for monomerid = 236682
Trg + Lig
Ki
nM
ΔG°
kcal/mole
IC50
nM
Kd
nM
EC50/IC50
nM
koff
s-1
kon
M-1s-1
pHTemp
°C
Dual specificity protein kinase TTK
(Homo sapiens (Human))
BDBM236682
(US9388140, 23)
Show SMILES Cc1cc(ccc1C(=O)NC1CC1)-n1cnc2c(NCC3CCOCC3)cc(Oc3ccc(Cl)cc3)cc12
Show InChI InChI=1S/C30H31ClN4O3/c1-19-14-23(6-9-26(19)30(36)34-22-4-5-22)35-18-33-29-27(32-17-20-10-12-37-13-11-20)15-25(16-28(29)35)38-24-7-2-21(31)3-8-24/h2-3,6-9,14-16,18,20,22,32H,4-5,10-13,17H2,1H3,(H,34,36)
US Patent
n/an/a 2.20n/an/an/an/a7.722
Bayer Intellectual Property GmbH
US Patent
Assay Description
For the assay 50 nL of a 100-fold concentrated solution of the test compound in DMSO was pipetted into a black low volume 384 well microtiter plate (...
US Patent US9388140 (2016)
BindingDB Entry DOI: 10.7270/Q2BP01QF