BDBM236686 US9388140, 27
SMILES: Cc1cc(ccc1C(=O)NC1CC1)-n1cnc2c(NCCC(F)(F)F)cc(Oc3ccc(F)c(F)c3)cc12
InChI Key: InChIKey=GRARRRPUNNWIHY-UHFFFAOYSA-N
Data: 1 IC50
Activity Spreadsheet -- Enzyme Inhibition Constant Data from BindingDB
Found 1 hit for monomerid = 236686
Trg + Lig
Ki
nM
ΔG°
kcal/mole
IC50
nM
Kd
nM
EC50/IC50
nM
koff
s-1
kon
M-1s-1
pHTemp
°C
Dual specificity protein kinase TTK
(Homo sapiens (Human))
BDBM236686
(US9388140, 27)
Show SMILES Cc1cc(ccc1C(=O)NC1CC1)-n1cnc2c(NCCC(F)(F)F)cc(Oc3ccc(F)c(F)c3)cc12
Show InChI InChI=1S/C27H23F5N4O2/c1-15-10-17(4-6-20(15)26(37)35-16-2-3-16)36-14-34-25-23(33-9-8-27(30,31)32)12-19(13-24(25)36)38-18-5-7-21(28)22(29)11-18/h4-7,10-14,16,33H,2-3,8-9H2,1H3,(H,35,37)
US Patent
n/an/a 1.40n/an/an/an/a7.722
Bayer Intellectual Property GmbH
US Patent
Assay Description
For the assay 50 nL of a 100-fold concentrated solution of the test compound in DMSO was pipetted into a black low volume 384 well microtiter plate (...
US Patent US9388140 (2016)
BindingDB Entry DOI: 10.7270/Q2BP01QF