BDBM236715 US9388140, 56
SMILES: CNC(=O)c1ccc(cc1C)-n1cnc2c(NCCC(F)(F)F)cc(Oc3ccccc3O)cc12
InChI Key: InChIKey=RYTOPGFZWRYIME-UHFFFAOYSA-N
Data: 1 IC50
Activity Spreadsheet -- Enzyme Inhibition Constant Data from BindingDB
Found 1 hit for monomerid = 236715
Trg + Lig
Ki
nM
ΔG°
kcal/mole
IC50
nM
Kd
nM
EC50/IC50
nM
koff
s-1
kon
M-1s-1
pHTemp
°C
Dual specificity protein kinase TTK
(Homo sapiens (Human))
BDBM236715
(US9388140, 56)
Show SMILES CNC(=O)c1ccc(cc1C)-n1cnc2c(NCCC(F)(F)F)cc(Oc3ccccc3O)cc12
Show InChI InChI=1S/C25H23F3N4O3/c1-15-11-16(7-8-18(15)24(34)29-2)32-14-31-23-19(30-10-9-25(26,27)28)12-17(13-20(23)32)35-22-6-4-3-5-21(22)33/h3-8,11-14,30,33H,9-10H2,1-2H3,(H,29,34)
US Patent
n/an/a 0.300n/an/an/an/a7.722
Bayer Intellectual Property GmbH
US Patent
Assay Description
For the assay 50 nL of a 100-fold concentrated solution of the test compound in DMSO was pipetted into a black low volume 384 well microtiter plate (...
US Patent US9388140 (2016)
BindingDB Entry DOI: 10.7270/Q2BP01QF