null
SMILES: Cc1cc(ccc1C(=O)NC1CC1)-n1cnc2c(NCC3CCOCC3)cc(Oc3ccc(O)cc3F)cc12
InChI Key: InChIKey=YFKVEWKBYYMMMK-UHFFFAOYSA-N
Activity Spreadsheet -- Enzyme Inhibition Constant Data from BindingDB
Found 1 hit for monomerid = 236778
Trg + Lig
Ki
nM
ΔG°
kcal/mole
IC50
nM
Kd
nM
EC50/IC50
nM
koff
s-1
kon
M-1s-1
pHTemp
°C
Dual specificity protein kinase TTK
(Homo sapiens (Human))
BDBM236778
(US9388140, 116A)
Show SMILES Cc1cc(ccc1C(=O)NC1CC1)-n1cnc2c(NCC3CCOCC3)cc(Oc3ccc(O)cc3F)cc12
Show InChI InChI=1S/C30H31FN4O4/c1-18-12-21(4-6-24(18)30(37)34-20-2-3-20)35-17-33-29-26(32-16-19-8-10-38-11-9-19)14-23(15-27(29)35)39-28-7-5-22(36)13-25(28)31/h4-7,12-15,17,19-20,32,36H,2-3,8-11,16H2,1H3,(H,34,37)
US Patent
n/an/a 1n/an/an/an/a7.722
Bayer Intellectual Property GmbH
US Patent
Assay Description
For the assay 50 nL of a 100-fold concentrated solution of the test compound in DMSO was pipetted into a black low volume 384 well microtiter plate (...
US Patent US9388140 (2016)
BindingDB Entry DOI: 10.7270/Q2BP01QF