BDBM23783 (bromodiphenylmethyl)benzene::Triphenylmethyl-containing compound, 12
SMILES: BrC(c1ccccc1)(c1ccccc1)c1ccccc1
InChI Key: InChIKey=NZHXEWZGTQSYJM-UHFFFAOYSA-N
Data: 1 Other
Activity Spreadsheet -- Enzyme Inhibition Constant Data from BindingDB
Found 1 hit for monomerid = 23783
Trg + Lig
Ki
nM
ΔG°
kcal/mole
IC50
nM
Kd
nM
EC50/IC50
nM
koff
s-1
kon
M-1s-1
pHTemp
°C
Kinesin-like protein KIF11
(Homo sapiens (Human))
BDBM23783
((bromodiphenylmethyl)benzene | Triphenylmethyl-con...)
Show SMILES BrC(c1ccccc1)(c1ccccc1)c1ccccc1
Show InChI InChI=1S/C19H15Br/c20-19(16-10-4-1-5-11-16,17-12-6-2-7-13-17)18-14-8-3-9-15-18/h1-15H
Reactome pathway
n/an/an/an/an/an/an/a6.922
Institut de Biologie Structurale
Assay Description
The microtubule-activated ATPase rates were measured using the pyruvate kinase/lactate dehydrogenase-linked assay. To optimize the signal for basal E...
J Med Chem 51: 1115-25 (2008)
Article DOI: 10.1021/jm070606z
BindingDB Entry DOI: 10.7270/Q2DJ5CXD