BDBM23786 Triphenylmethyl-containing compound, 15::triphenylmethanamine
SMILES: NC(c1ccccc1)(c1ccccc1)c1ccccc1
InChI Key: InChIKey=BZVJOYBTLHNRDW-UHFFFAOYSA-N
Data: 1 IC50  1 Other
Activity Spreadsheet -- Enzyme Inhibition Constant Data from BindingDB
Found 2 hits for monomerid = 23786
Trg + Lig
Ki
nM
ΔG°
kcal/mole
IC50
nM
Kd
nM
EC50/IC50
nM
koff
s-1
kon
M-1s-1
pHTemp
°C
Intermediate conductance calcium-activated potassium channel protein 4
(Homo sapiens (Human))
BDBM23786
(Triphenylmethyl-containing compound, 15 | tripheny...)
Show SMILES NC(c1ccccc1)(c1ccccc1)c1ccccc1
Show InChI InChI=1S/C19H17N/c20-19(16-10-4-1-5-11-16,17-12-6-2-7-13-17)18-14-8-3-9-15-18/h1-15H,20H2
Reactome pathway
n/an/a 70n/an/an/an/an/an/a
Icagen, Inc.
Curated by ChEMBL
Assay Description
Inhibition of Gardos channel in human RBC assessed as inhibition of ionomycin-stimulated [86Rb] efflux
J Med Chem 51: 976-82 (2008)
Article DOI: 10.1021/jm070663s
BindingDB Entry DOI: 10.7270/Q23F4QGH
Kinesin Spindle Protein Eg5
(Homo sapiens (Human))
BDBM23786
(Triphenylmethyl-containing compound, 15 | tripheny...)
Show SMILES NC(c1ccccc1)(c1ccccc1)c1ccccc1
Show InChI InChI=1S/C19H17N/c20-19(16-10-4-1-5-11-16,17-12-6-2-7-13-17)18-14-8-3-9-15-18/h1-15H,20H2
Reactome pathway
n/an/an/an/an/an/an/a6.922
Institut de Biologie Structurale
Assay Description
The microtubule-activated ATPase rates were measured using the pyruvate kinase/lactate dehydrogenase-linked assay. To optimize the signal for basal E...
J Med Chem 51: 1115-25 (2008)
Article DOI: 10.1021/jm070606z
BindingDB Entry DOI: 10.7270/Q2DJ5CXD