BDBM237961 US9394285, 42
SMILES: OC(=O)c1c[nH]c2cc(Cl)c(cc12)-c1ccc(c(F)c1)C1(O)CCC1
InChI Key: InChIKey=VJRMUMYLSWYBNV-UHFFFAOYSA-N
Data: 1 EC50
Activity Spreadsheet -- Enzyme Inhibition Constant Data from BindingDB
Found 1 hit for monomerid = 237961
Trg + Lig
Ki
nM
ΔG°
kcal/mole
IC50
nM
Kd
nM
EC50/IC50
nM
koff
s-1
kon
M-1s-1
pHTemp
°C
5'-AMP-activated protein kinase catalytic subunit alpha-1/subunit beta-1/subunit gamma-1
(Homo sapiens (Human))
BDBM237961
(US9394285, 42)
Show SMILES OC(=O)c1c[nH]c2cc(Cl)c(cc12)-c1ccc(c(F)c1)C1(O)CCC1
Show InChI InChI=1S/C19H15ClFNO3/c20-15-8-17-12(13(9-22-17)18(23)24)7-11(15)10-2-3-14(16(21)6-10)19(25)4-1-5-19/h2-3,6-9,22,25H,1,4-5H2,(H,23,24)
US Patent
n/an/an/an/a 21.8n/an/a7.525
Pfizer Inc.
US Patent
Assay Description
The biochemical EC50 (half-maximal concentration required for full activation) of compounds for the activation of AMPK was evaluated by 33P-based ass...
US Patent US9394285 (2016)
BindingDB Entry DOI: 10.7270/Q2DB80Q7