BDBM23797 2-[(triphenylmethyl)sulfanyl]ethan-1-ol::Triphenylmethyl-containing compound, 26
SMILES: OCCSC(c1ccccc1)(c1ccccc1)c1ccccc1
InChI Key: InChIKey=OSBZFOJENKWGPX-UHFFFAOYSA-N
Data: 1 Other
Activity Spreadsheet -- Enzyme Inhibition Constant Data from BindingDB
Found 1 hit for monomerid = 23797
Trg + Lig
Ki
nM
ΔG°
kcal/mole
IC50
nM
Kd
nM
EC50/IC50
nM
koff
s-1
kon
M-1s-1
pHTemp
°C
Kinesin-like protein KIF11
(Homo sapiens (Human))
BDBM23797
(2-[(triphenylmethyl)sulfanyl]ethan-1-ol | Tripheny...)
Show SMILES OCCSC(c1ccccc1)(c1ccccc1)c1ccccc1
Show InChI InChI=1S/C21H20OS/c22-16-17-23-21(18-10-4-1-5-11-18,19-12-6-2-7-13-19)20-14-8-3-9-15-20/h1-15,22H,16-17H2
Reactome pathway
n/an/an/an/an/an/an/a6.922
Institut de Biologie Structurale
Assay Description
The microtubule-activated ATPase rates were measured using the pyruvate kinase/lactate dehydrogenase-linked assay. To optimize the signal for basal E...
J Med Chem 51: 1115-25 (2008)
Article DOI: 10.1021/jm070606z
BindingDB Entry DOI: 10.7270/Q2DJ5CXD