BDBM237973 US9394285, 56
SMILES: COc1cc(ccc1C(C)(C)O)-c1cc2c(c[nH]c2cc1Cl)C(O)=O
InChI Key: InChIKey=SZEODOAWASYAPC-UHFFFAOYSA-N
Data: 1 EC50
Activity Spreadsheet -- Enzyme Inhibition Constant Data from BindingDB
Found 1 hit for monomerid = 237973
Trg + Lig
Ki
nM
ΔG°
kcal/mole
IC50
nM
Kd
nM
EC50/IC50
nM
koff
s-1
kon
M-1s-1
pHTemp
°C
5'-AMP-activated protein kinase Complex 1
(Homo sapiens (Human))
BDBM237973
(US9394285, 56)
Show SMILES COc1cc(ccc1C(C)(C)O)-c1cc2c(c[nH]c2cc1Cl)C(O)=O
Show InChI InChI=1S/C19H18ClNO4/c1-19(2,24)14-5-4-10(6-17(14)25-3)11-7-12-13(18(22)23)9-21-16(12)8-15(11)20/h4-9,21,24H,1-3H3,(H,22,23)
US Patent
n/an/an/an/a 334n/an/a7.525
Pfizer Inc.
US Patent
Assay Description
The biochemical EC50 (half-maximal concentration required for full activation) of compounds for the activation of AMPK was evaluated by 33P-based ass...
US Patent US9394285 (2016)
BindingDB Entry DOI: 10.7270/Q2DB80Q7