null
SMILES: COc1cc(ccc1-c1cc2c(c[nH]c2cc1Cl)C(O)=O)C1(O)COC1
InChI Key: InChIKey=WUAMEFNVERVFOG-UHFFFAOYSA-N
Activity Spreadsheet -- Enzyme Inhibition Constant Data from BindingDB
Found 1 hit for monomerid = 237979
Trg + Lig
Ki
nM
ΔG°
kcal/mole
IC50
nM
Kd
nM
EC50/IC50
nM
koff
s-1
kon
M-1s-1
pHTemp
°C
5'-AMP-activated protein kinase catalytic subunit alpha-1/subunit beta-1/subunit gamma-1
(Homo sapiens (Human))
BDBM237979
(US9394285, 62)
Show SMILES COc1cc(ccc1-c1cc2c(c[nH]c2cc1Cl)C(O)=O)C1(O)COC1
Show InChI InChI=1S/C19H16ClNO5/c1-25-17-4-10(19(24)8-26-9-19)2-3-11(17)12-5-13-14(18(22)23)7-21-16(13)6-15(12)20/h2-7,21,24H,8-9H2,1H3,(H,22,23)
US Patent
n/an/an/an/a 33.3n/an/a7.525
Pfizer Inc.
US Patent
Assay Description
The biochemical EC50 (half-maximal concentration required for full activation) of compounds for the activation of AMPK was evaluated by 33P-based ass...
US Patent US9394285 (2016)
BindingDB Entry DOI: 10.7270/Q2DB80Q7